1,3-Butanediol anion

Gas phase thermochemistry data

Data compiled by: John E. Bartmess

Quantity Value Units Method Reference Comment
Δfgas-434.0 ± 3.0kJ/molR-EACarles, Desfrancois, et al., 2001

References

Carles, Desfrancois, et al., 2001
Carles, S.; Desfrancois, C.; Schermann, J.P.; Jalbout, A.F.; Adamowicz, L., Dipole-bound anion of 1,3-butanediol. Ab initio and Rydberg electron transfer spectroscopy study, Chem. Phys., 2001, 334, 374-380. [all data]