Sulfur dioxide, protonated

Reaction thermochemistry data

Data compiled by: Michael M. Meot-Ner (Mautner) and Sharon G. Lias

Individual Reactions

HO2S+ + Sulfur dioxide = (HO2S+ • Sulfur dioxide)

By formula: HO2S+ + O2S = (HO2S+ • O2S)

Quantity Value Units Method Reference Comment
Δr89.1kJ/molPHPMSSzulejko and McMahon, 1992gas phase
Δr97.1kJ/molPHPMSMcMahon and Kebarle, 1986gas phase
Quantity Value Units Method Reference Comment
Δr108.J/mol*KPHPMSSzulejko and McMahon, 1992gas phase
Δr115.J/mol*KPHPMSMcMahon and Kebarle, 1986gas phase

HO2S+ + Methyl fluoride = (HO2S+ • Methyl fluoride)

By formula: HO2S+ + CH3F = (HO2S+ • CH3F)

Quantity Value Units Method Reference Comment
Δr106.kJ/molPHPMSMcMahon and Kebarle, 1986gas phase; switching reaction(SO2H+)SO2
Quantity Value Units Method Reference Comment
Δr119.J/mol*KPHPMSMcMahon and Kebarle, 1986gas phase; switching reaction(SO2H+)SO2

Ion clustering data

Data compiled by: Michael M. Meot-Ner (Mautner) and Sharon G. Lias

Clustering reactions

HO2S+ + Methyl fluoride = (HO2S+ • Methyl fluoride)

By formula: HO2S+ + CH3F = (HO2S+ • CH3F)

Quantity Value Units Method Reference Comment
Δr106.kJ/molPHPMSMcMahon and Kebarle, 1986gas phase; switching reaction(SO2H+)SO2
Quantity Value Units Method Reference Comment
Δr119.J/mol*KPHPMSMcMahon and Kebarle, 1986gas phase; switching reaction(SO2H+)SO2

HO2S+ + Sulfur dioxide = (HO2S+ • Sulfur dioxide)

By formula: HO2S+ + O2S = (HO2S+ • O2S)

Quantity Value Units Method Reference Comment
Δr89.1kJ/molPHPMSSzulejko and McMahon, 1992gas phase
Δr97.1kJ/molPHPMSMcMahon and Kebarle, 1986gas phase
Quantity Value Units Method Reference Comment
Δr108.J/mol*KPHPMSSzulejko and McMahon, 1992gas phase
Δr115.J/mol*KPHPMSMcMahon and Kebarle, 1986gas phase

References

Szulejko and McMahon, 1992
Szulejko, J.; McMahon, T.B., personal communication, 1992. [all data]

McMahon and Kebarle, 1986
McMahon, T.B.; Kebarle, P., Strong hydrogen bonding in gas-phase ions: A high pressure mass spectrometric study of formation and energetics of methyl fluoride proton bound dimer, J. Am. Chem. Soc., 1986, 108, 6502. [all data]