Nitrous oxide, protonated

Reaction thermochemistry data

Data compiled by: Michael M. Meot-Ner (Mautner) and Sharon G. Lias

Individual Reactions

HN2O+ + Nitrous oxide = (HN2O+ • Nitrous oxide)

By formula: HN2O+ + N2O = (HN2O+ • N2O)

Quantity Value Units Method Reference Comment
Δr69.9kJ/molPHPMSHiraoka, Fujimaki, et al., 1994gas phase
Δr86.2kJ/molPHPMSSzulejko and McMahon, 1992gas phase
Quantity Value Units Method Reference Comment
Δr84.J/mol*KPHPMSHiraoka, Fujimaki, et al., 1994gas phase
Δr132.J/mol*KPHPMSSzulejko and McMahon, 1992gas phase

(HN2O+ • 5Nitrous oxide) + Nitrous oxide = (HN2O+ • 6Nitrous oxide)

By formula: (HN2O+ • 5N2O) + N2O = (HN2O+ • 6N2O)

Quantity Value Units Method Reference Comment
Δr20.kJ/molPHPMSHiraoka, Fujimaki, et al., 1994gas phase; Entropy change calculated or estimated
Quantity Value Units Method Reference Comment
Δr130.J/mol*KN/AHiraoka, Fujimaki, et al., 1994gas phase; Entropy change calculated or estimated

(HN2O+ • 2Nitrous oxide) + Nitrous oxide = (HN2O+ • 3Nitrous oxide)

By formula: (HN2O+ • 2N2O) + N2O = (HN2O+ • 3N2O)

Quantity Value Units Method Reference Comment
Δr24.kJ/molPHPMSHiraoka, Fujimaki, et al., 1994gas phase
Quantity Value Units Method Reference Comment
Δr100.J/mol*KPHPMSHiraoka, Fujimaki, et al., 1994gas phase

(HN2O+ • 3Nitrous oxide) + Nitrous oxide = (HN2O+ • 4Nitrous oxide)

By formula: (HN2O+ • 3N2O) + N2O = (HN2O+ • 4N2O)

Quantity Value Units Method Reference Comment
Δr23.kJ/molPHPMSHiraoka, Fujimaki, et al., 1994gas phase
Quantity Value Units Method Reference Comment
Δr120.J/mol*KPHPMSHiraoka, Fujimaki, et al., 1994gas phase

(HN2O+ • 4Nitrous oxide) + Nitrous oxide = (HN2O+ • 5Nitrous oxide)

By formula: (HN2O+ • 4N2O) + N2O = (HN2O+ • 5N2O)

Quantity Value Units Method Reference Comment
Δr21.kJ/molPHPMSHiraoka, Fujimaki, et al., 1994gas phase
Quantity Value Units Method Reference Comment
Δr130.J/mol*KPHPMSHiraoka, Fujimaki, et al., 1994gas phase

(HN2O+ • Nitrous oxide) + Nitrous oxide = (HN2O+ • 2Nitrous oxide)

By formula: (HN2O+ • N2O) + N2O = (HN2O+ • 2N2O)

Quantity Value Units Method Reference Comment
Δr27.kJ/molPHPMSHiraoka, Fujimaki, et al., 1994gas phase
Quantity Value Units Method Reference Comment
Δr84.J/mol*KPHPMSHiraoka, Fujimaki, et al., 1994gas phase

Ion clustering data

Data compiled by: Michael M. Meot-Ner (Mautner) and Sharon G. Lias

Clustering reactions

HN2O+ + Nitrous oxide = (HN2O+ • Nitrous oxide)

By formula: HN2O+ + N2O = (HN2O+ • N2O)

Quantity Value Units Method Reference Comment
Δr16.7kcal/molPHPMSHiraoka, Fujimaki, et al., 1994gas phase
Δr20.6kcal/molPHPMSSzulejko and McMahon, 1992gas phase
Quantity Value Units Method Reference Comment
Δr20.cal/mol*KPHPMSHiraoka, Fujimaki, et al., 1994gas phase
Δr31.5cal/mol*KPHPMSSzulejko and McMahon, 1992gas phase

(HN2O+ • Nitrous oxide) + Nitrous oxide = (HN2O+ • 2Nitrous oxide)

By formula: (HN2O+ • N2O) + N2O = (HN2O+ • 2N2O)

Quantity Value Units Method Reference Comment
Δr6.4kcal/molPHPMSHiraoka, Fujimaki, et al., 1994gas phase
Quantity Value Units Method Reference Comment
Δr20.cal/mol*KPHPMSHiraoka, Fujimaki, et al., 1994gas phase

(HN2O+ • 2Nitrous oxide) + Nitrous oxide = (HN2O+ • 3Nitrous oxide)

By formula: (HN2O+ • 2N2O) + N2O = (HN2O+ • 3N2O)

Quantity Value Units Method Reference Comment
Δr5.8kcal/molPHPMSHiraoka, Fujimaki, et al., 1994gas phase
Quantity Value Units Method Reference Comment
Δr25.cal/mol*KPHPMSHiraoka, Fujimaki, et al., 1994gas phase

(HN2O+ • 3Nitrous oxide) + Nitrous oxide = (HN2O+ • 4Nitrous oxide)

By formula: (HN2O+ • 3N2O) + N2O = (HN2O+ • 4N2O)

Quantity Value Units Method Reference Comment
Δr5.4kcal/molPHPMSHiraoka, Fujimaki, et al., 1994gas phase
Quantity Value Units Method Reference Comment
Δr29.cal/mol*KPHPMSHiraoka, Fujimaki, et al., 1994gas phase

(HN2O+ • 4Nitrous oxide) + Nitrous oxide = (HN2O+ • 5Nitrous oxide)

By formula: (HN2O+ • 4N2O) + N2O = (HN2O+ • 5N2O)

Quantity Value Units Method Reference Comment
Δr5.0kcal/molPHPMSHiraoka, Fujimaki, et al., 1994gas phase
Quantity Value Units Method Reference Comment
Δr30.cal/mol*KPHPMSHiraoka, Fujimaki, et al., 1994gas phase

(HN2O+ • 5Nitrous oxide) + Nitrous oxide = (HN2O+ • 6Nitrous oxide)

By formula: (HN2O+ • 5N2O) + N2O = (HN2O+ • 6N2O)

Quantity Value Units Method Reference Comment
Δr4.8kcal/molPHPMSHiraoka, Fujimaki, et al., 1994gas phase; Entropy change calculated or estimated
Quantity Value Units Method Reference Comment
Δr30.cal/mol*KN/AHiraoka, Fujimaki, et al., 1994gas phase; Entropy change calculated or estimated

References

Hiraoka, Fujimaki, et al., 1994
Hiraoka, K.; Fujimaki, S.; Aruga, K.; Sato, T.; Yamabe, S., Gas-Phase Solavtion of NO+, O2+, N2O+, and H3O+ with N2O, J. Chem. Phys., 1994, 101, 5, 4073, https://doi.org/10.1063/1.467524 . [all data]

Szulejko and McMahon, 1992
Szulejko, J.; McMahon, T.B., personal communication, 1992. [all data]