Triphosphine, protonated

Reaction thermochemistry data

Data compiled by: Michael M. Meot-Ner (Mautner) and Sharon G. Lias

Individual Reactions

H6P3+ + Phosphine = (H6P3+ • Phosphine)

By formula: H6P3+ + H3P = (H6P3+ • H3P)

Quantity Value Units Method Reference Comment
Δr10.8kcal/molDTLong and Franklin, 1974gas phase
Quantity Value Units Method Reference Comment
Δr34.cal/mol*KDTLong and Franklin, 1974gas phase

References

Long and Franklin, 1974
Long, J.W.; Franklin, J.L., Ion - Solvation Reactions of Phosphine, J. Am. Chem. Soc., 1974, 96, 8, 2320, https://doi.org/10.1021/ja00815a003 . [all data]