Diphosphine, protonated

Ion clustering data

Data compiled by: Michael M. Meot-Ner (Mautner) and Sharon G. Lias

Clustering reactions

H5P2+ + Phosphine = (H5P2+ • Phosphine)

By formula: H5P2+ + H3P = (H5P2+ • H3P)

Quantity Value Units Method Reference Comment
Δr40.kJ/molDTLong and Franklin, 1974gas phase
Quantity Value Units Method Reference Comment
Δr84.J/mol*KDTLong and Franklin, 1974gas phase

References

Long and Franklin, 1974
Long, J.W.; Franklin, J.L., Ion - Solvation Reactions of Phosphine, J. Am. Chem. Soc., 1974, 96, 8, 2320, https://doi.org/10.1021/ja00815a003 . [all data]