Methyl mercaptan, protonated

Reaction thermochemistry data

Data compiled by: Michael M. Meot-Ner (Mautner) and Sharon G. Lias

Individual Reactions

CH5S+ + Water = (CH5S+ • Water)

By formula: CH5S+ + H2O = (CH5S+ • H2O)

Quantity Value Units Method Reference Comment
Δr64.9kJ/molPHPMSMeot-Ner (Mautner) and Sieck, 1985gas phase; Entropy change calculated or estimated
Δr56.5kJ/molICRBerman and Beauchamp, 1986gas phase; bracketing; Lias, Liebman, et al., 1984
Quantity Value Units Method Reference Comment
Δr92.J/mol*KN/AMeot-Ner (Mautner) and Sieck, 1985gas phase; Entropy change calculated or estimated

Free energy of reaction

ΔrG° (kJ/mol) T (K) Method Reference Comment
22.476.PHPMSMeot-Ner (Mautner) and Sieck, 1985gas phase; Entropy change calculated or estimated

Ion clustering data

Data compiled by: Michael M. Meot-Ner (Mautner) and Sharon G. Lias

Clustering reactions

CH5S+ + Water = (CH5S+ • Water)

By formula: CH5S+ + H2O = (CH5S+ • H2O)

Quantity Value Units Method Reference Comment
Δr15.5kcal/molPHPMSMeot-Ner (Mautner) and Sieck, 1985gas phase; Entropy change calculated or estimated
Δr13.5kcal/molICRBerman and Beauchamp, 1986gas phase; bracketing; Lias, Liebman, et al., 1984
Quantity Value Units Method Reference Comment
Δr22.cal/mol*KN/AMeot-Ner (Mautner) and Sieck, 1985gas phase; Entropy change calculated or estimated

Free energy of reaction

ΔrG° (kcal/mol) T (K) Method Reference Comment
5.2476.PHPMSMeot-Ner (Mautner) and Sieck, 1985gas phase; Entropy change calculated or estimated

References

Meot-Ner (Mautner) and Sieck, 1985
Meot-Ner (Mautner), M.; Sieck, L.W., The Ionic Hydrogen Bond and Ion Solvation. 4. SH+ O and NH+ S Bonds. Correlations with Proton Affinity. Mutual Effects of Weak and Strong Ligands in Mixed Clusters, J. Phys. Chem., 1985, 89, 24, 5222, https://doi.org/10.1021/j100270a021 . [all data]

Berman and Beauchamp, 1986
Berman, D.W.; Beauchamp, J.L., Quoted in Keesee and Castleman, 1986, 1986. [all data]

Lias, Liebman, et al., 1984
Lias, S.G.; Liebman, J.F.; Levin, R.D., Evaluated gas phase basicities and proton affinities of molecules heats of formation of protonated molecules, J. Phys. Chem. Ref. Data, 1984, 13, 695. [all data]

Keesee and Castleman, 1986
Keesee, R.G.; Castleman, A.W., Jr., Thermochemical data on Ggs-phase ion-molecule association and clustering reactions, J. Phys. Chem. Ref. Data, 1986, 15, 1011. [all data]