Formamide, protonated

Reaction thermochemistry data

Data compiled by: Michael M. Meot-Ner (Mautner) and Sharon G. Lias

Individual Reactions

(CH4NO+ • 2Water) + Water = (CH4NO+ • 3Water)

By formula: (CH4NO+ • 2H2O) + H2O = (CH4NO+ • 3H2O)

Bond type: Hydrogen bond (positive ion to hydride)

Quantity Value Units Method Reference Comment
Δr49.4kJ/molPHPMSMeot-Ner (Mautner), 1984gas phase
Δr49.4kJ/molPHPMSMeot-Ner, 1984gas phase
Quantity Value Units Method Reference Comment
Δr87.9J/mol*KPHPMSMeot-Ner (Mautner), 1984gas phase
Δr87.9J/mol*KPHPMSMeot-Ner, 1984gas phase

(CH4NO+ • Water) + Water = (CH4NO+ • 2Water)

By formula: (CH4NO+ • H2O) + H2O = (CH4NO+ • 2H2O)

Bond type: Hydrogen bond (positive ion to hydride)

Quantity Value Units Method Reference Comment
Δr58.6kJ/molPHPMSMeot-Ner (Mautner), 1984gas phase
Δr58.6kJ/molPHPMSMeot-Ner, 1984gas phase
Quantity Value Units Method Reference Comment
Δr95.4J/mol*KPHPMSMeot-Ner (Mautner), 1984gas phase
Δr95.0J/mol*KPHPMSMeot-Ner, 1984gas phase

(CH4NO+ • 3Water) + Water = (CH4NO+ • 4Water)

By formula: (CH4NO+ • 3H2O) + H2O = (CH4NO+ • 4H2O)

Bond type: Hydrogen bond (positive ion to hydride)

Quantity Value Units Method Reference Comment
Δr41.kJ/molPHPMSMeot-Ner (Mautner), 1984gas phase
Δr41.kJ/molPHPMSMeot-Ner, 1984gas phase
Quantity Value Units Method Reference Comment
Δr84.5J/mol*KPHPMSMeot-Ner (Mautner), 1984gas phase
Δr84.5J/mol*KPHPMSMeot-Ner, 1984gas phase

(CH4NO+ • 4Water) + Water = (CH4NO+ • 5Water)

By formula: (CH4NO+ • 4H2O) + H2O = (CH4NO+ • 5H2O)

Bond type: Hydrogen bond (positive ion to hydride)

Quantity Value Units Method Reference Comment
Δr41.kJ/molPHPMSMeot-Ner (Mautner), 1984gas phase
Δr41.kJ/molPHPMSMeot-Ner, 1984gas phase
Quantity Value Units Method Reference Comment
Δr107.J/mol*KPHPMSMeot-Ner (Mautner), 1984gas phase
Δr107.J/mol*KPHPMSMeot-Ner, 1984gas phase

CH4NO+ + Water = (CH4NO+ • Water)

By formula: CH4NO+ + H2O = (CH4NO+ • H2O)

Bond type: Hydrogen bond (positive ion to hydride)

Quantity Value Units Method Reference Comment
Δr88.7kJ/molPHPMSMeot-Ner (Mautner), 1984gas phase
Δr89.1kJ/molPHPMSMeot-Ner, 1984gas phase
Quantity Value Units Method Reference Comment
Δr114.J/mol*KPHPMSMeot-Ner (Mautner), 1984gas phase
Δr114.J/mol*KPHPMSMeot-Ner, 1984gas phase

CH4NO+ + Hydrogen cyanide = (CH4NO+ • Hydrogen cyanide)

By formula: CH4NO+ + CHN = (CH4NO+ • CHN)

Quantity Value Units Method Reference Comment
Δr80.8kJ/molPHPMSSpeller and Meot-Ner (Mautner), 1985gas phase
Quantity Value Units Method Reference Comment
Δr96.J/mol*KPHPMSSpeller and Meot-Ner (Mautner), 1985gas phase

Free energy of reaction

ΔrG° (kJ/mol) T (K) Method Reference Comment
40.427.PHPMSSpeller and Meot-Ner (Mautner), 1985gas phase

Ion clustering data

Data compiled by: Michael M. Meot-Ner (Mautner) and Sharon G. Lias

Clustering reactions

CH4NO+ + Hydrogen cyanide = (CH4NO+ • Hydrogen cyanide)

By formula: CH4NO+ + CHN = (CH4NO+ • CHN)

Quantity Value Units Method Reference Comment
Δr80.8kJ/molPHPMSSpeller and Meot-Ner (Mautner), 1985gas phase
Quantity Value Units Method Reference Comment
Δr96.J/mol*KPHPMSSpeller and Meot-Ner (Mautner), 1985gas phase

Free energy of reaction

ΔrG° (kJ/mol) T (K) Method Reference Comment
40.427.PHPMSSpeller and Meot-Ner (Mautner), 1985gas phase

CH4NO+ + Water = (CH4NO+ • Water)

By formula: CH4NO+ + H2O = (CH4NO+ • H2O)

Bond type: Hydrogen bond (positive ion to hydride)

Quantity Value Units Method Reference Comment
Δr88.7kJ/molPHPMSMeot-Ner (Mautner), 1984gas phase
Δr89.1kJ/molPHPMSMeot-Ner, 1984gas phase
Quantity Value Units Method Reference Comment
Δr114.J/mol*KPHPMSMeot-Ner (Mautner), 1984gas phase
Δr114.J/mol*KPHPMSMeot-Ner, 1984gas phase

(CH4NO+ • Water) + Water = (CH4NO+ • 2Water)

By formula: (CH4NO+ • H2O) + H2O = (CH4NO+ • 2H2O)

Bond type: Hydrogen bond (positive ion to hydride)

Quantity Value Units Method Reference Comment
Δr58.6kJ/molPHPMSMeot-Ner (Mautner), 1984gas phase
Δr58.6kJ/molPHPMSMeot-Ner, 1984gas phase
Quantity Value Units Method Reference Comment
Δr95.4J/mol*KPHPMSMeot-Ner (Mautner), 1984gas phase
Δr95.0J/mol*KPHPMSMeot-Ner, 1984gas phase

(CH4NO+ • 2Water) + Water = (CH4NO+ • 3Water)

By formula: (CH4NO+ • 2H2O) + H2O = (CH4NO+ • 3H2O)

Bond type: Hydrogen bond (positive ion to hydride)

Quantity Value Units Method Reference Comment
Δr49.4kJ/molPHPMSMeot-Ner (Mautner), 1984gas phase
Δr49.4kJ/molPHPMSMeot-Ner, 1984gas phase
Quantity Value Units Method Reference Comment
Δr87.9J/mol*KPHPMSMeot-Ner (Mautner), 1984gas phase
Δr87.9J/mol*KPHPMSMeot-Ner, 1984gas phase

(CH4NO+ • 3Water) + Water = (CH4NO+ • 4Water)

By formula: (CH4NO+ • 3H2O) + H2O = (CH4NO+ • 4H2O)

Bond type: Hydrogen bond (positive ion to hydride)

Quantity Value Units Method Reference Comment
Δr41.kJ/molPHPMSMeot-Ner (Mautner), 1984gas phase
Δr41.kJ/molPHPMSMeot-Ner, 1984gas phase
Quantity Value Units Method Reference Comment
Δr84.5J/mol*KPHPMSMeot-Ner (Mautner), 1984gas phase
Δr84.5J/mol*KPHPMSMeot-Ner, 1984gas phase

(CH4NO+ • 4Water) + Water = (CH4NO+ • 5Water)

By formula: (CH4NO+ • 4H2O) + H2O = (CH4NO+ • 5H2O)

Bond type: Hydrogen bond (positive ion to hydride)

Quantity Value Units Method Reference Comment
Δr41.kJ/molPHPMSMeot-Ner (Mautner), 1984gas phase
Δr41.kJ/molPHPMSMeot-Ner, 1984gas phase
Quantity Value Units Method Reference Comment
Δr107.J/mol*KPHPMSMeot-Ner (Mautner), 1984gas phase
Δr107.J/mol*KPHPMSMeot-Ner, 1984gas phase

References

Meot-Ner (Mautner), 1984
Meot-Ner (Mautner), M., The Ionic Hydrogen Bond and Ion Solvation. 2. Hydration of Onium Ions by 1 - 7 H2O Molecules. Relations Between Monomolecular, Specific and Bulk Hydration, J. Am. Chem. Soc., 1984, 106, 5, 1265, https://doi.org/10.1021/ja00317a016 . [all data]

Meot-Ner, 1984
Meot-Ner, (Mautner), The Ionic Hydrogen Bond. 4. Intramolecular and Multiple Bonds. Proton Affinities, Hydration and Complexes of Amides and Amino Acid Derivatives, J. Am. Chem. Soc., 1984, 106, 2, 278, https://doi.org/10.1021/ja00314a003 . [all data]

Speller and Meot-Ner (Mautner), 1985
Speller, C.V.; Meot-Ner (Mautner), M., The Ionic Hydrogen Bond and Ion Solvation. 3. Bonds Involving Cyanides. Correlations with Proton Affinites, J. Phys. Chem., 1985, 81, 24, 5217, https://doi.org/10.1021/j100270a020 . [all data]