Methyl fluoride, protonated

Reaction thermochemistry data

Data compiled by: Michael M. Meot-Ner (Mautner) and Sharon G. Lias

Individual Reactions

CH4F+ + Methyl fluoride = (CH4F+ • Methyl fluoride)

By formula: CH4F+ + CH3F = (CH4F+ • CH3F)

Quantity Value Units Method Reference Comment
Δr32. ± 2.kcal/molPHPMSMcMahon and Kebarle, 1986gas phase; switching reaction(SO2H+)SO2; Lias, Liebman, et al., 1984

Ion clustering data

Data compiled by: Michael M. Meot-Ner (Mautner) and Sharon G. Lias

Clustering reactions

CH4F+ + Methyl fluoride = (CH4F+ • Methyl fluoride)

By formula: CH4F+ + CH3F = (CH4F+ • CH3F)

Quantity Value Units Method Reference Comment
Δr32. ± 2.kcal/molPHPMSMcMahon and Kebarle, 1986gas phase; switching reaction(SO2H+)SO2; Lias, Liebman, et al., 1984

References

McMahon and Kebarle, 1986
McMahon, T.B.; Kebarle, P., Strong hydrogen bonding in gas-phase ions: A high pressure mass spectrometric study of formation and energetics of methyl fluoride proton bound dimer, J. Am. Chem. Soc., 1986, 108, 6502. [all data]

Lias, Liebman, et al., 1984
Lias, S.G.; Liebman, J.F.; Levin, R.D., Evaluated gas phase basicities and proton affinities of molecules heats of formation of protonated molecules, J. Phys. Chem. Ref. Data, 1984, 13, 695. [all data]