Phenylacetic acid, methyl ester, protonated

Reaction thermochemistry data

Data compiled by: Michael M. Meot-Ner (Mautner) and Sharon G. Lias

Individual Reactions

C9H11O2+ + Water = (C9H11O2+ • Water)

By formula: C9H11O2+ + H2O = (C9H11O2+ • H2O)

Bond type: Hydrogen bond (positive ion to hydride)

Quantity Value Units Method Reference Comment
Δr57.3kJ/molHPMSField, 1969gas phase; Entropy change is questionable
Quantity Value Units Method Reference Comment
Δr50.J/mol*KHPMSField, 1969gas phase; Entropy change is questionable

References

Field, 1969
Field, F.H., Chemical Ionization Mass Spectrometry. IX. Temperature and Pressure Studies with Benzyl Acetate and t-Amyl Acetate, J. Am. Chem. Soc., 1969, 91, 11, 2827, https://doi.org/10.1021/ja01039a002 . [all data]