Benzenamine, N,N-dimethyl-, protonated
- Formula: C8H12N+
- Molecular weight: 122.1870

Reaction thermochemistry data

Data compiled by: Michael M. Meot-Ner (Mautner) and Sharon G. Lias
Individual Reactions
By formula: C8H12N+ + H2O = (C8H12N+ • H2O)
Bond type: Hydrogen bond (positive ion to hydride)
Quantity | Value | Units | Method | Reference | Comment |
---|---|---|---|---|---|
ΔrH° | 45.6 | kJ/mol | PHPMS | Buttrill, 1983 | gas phase |
Quantity | Value | Units | Method | Reference | Comment |
ΔrS° | 88. | J/mol*K | PHPMS | Buttrill, 1983 | gas phase |

Ion clustering data

Data compiled by: Michael M. Meot-Ner (Mautner) and Sharon G. Lias
Clustering reactions
By formula: C8H12N+ + H2O = (C8H12N+ • H2O)
Bond type: Hydrogen bond (positive ion to hydride)
Quantity | Value | Units | Method | Reference | Comment |
---|---|---|---|---|---|
ΔrH° | 45.6 | kJ/mol | PHPMS | Buttrill, 1983 | gas phase |
Quantity | Value | Units | Method | Reference | Comment |
ΔrS° | 88. | J/mol*K | PHPMS | Buttrill, 1983 | gas phase |

References

Buttrill, 1983
Buttrill, S.E.,
Quoted in 83TAF, 1983. [all data]