3-Ethylaniline, protonated

Ion clustering data

Data compiled by: Michael M. Meot-Ner (Mautner) and Sharon G. Lias

Clustering reactions

C8H12N+ + Water = (C8H12N+ • Water)

By formula: C8H12N+ + H2O = (C8H12N+ • H2O)

Bond type: Hydrogen bond (positive ion to hydride)

Quantity Value Units Method Reference Comment
Δr55.2kJ/molPHPMSLau, Nishizawa, et al., 1981gas phase; Entropy change calculated or estimated, ring to N proton shift on hydration
Quantity Value Units Method Reference Comment
Δr92.J/mol*KN/ALau, Nishizawa, et al., 1981gas phase; Entropy change calculated or estimated, ring to N proton shift on hydration

Free energy of reaction

ΔrG° (kJ/mol) T (K) Method Reference Comment
15.434.PHPMSLau, Nishizawa, et al., 1981gas phase; Entropy change calculated or estimated, ring to N proton shift on hydration

References

Lau, Nishizawa, et al., 1981
Lau, Y.K.; Nishizawa, K.; Tse, A.; Brown, R.S.; Kebarle, P., Protonation and Site of Protonation in Anilines. Hydration and Site of Protonation after Hydration, J. Am. Chem. Soc., 1981, 103, 21, 6291, https://doi.org/10.1021/ja00411a004 . [all data]