2-Isopropylpyridine, protonated

Reaction thermochemistry data

Data compiled by: Michael M. Meot-Ner (Mautner) and Sharon G. Lias

Individual Reactions

C8H12N+ + Water = (C8H12N+ • Water)

By formula: C8H12N+ + H2O = (C8H12N+ • H2O)

Bond type: Hydrogen bond (positive ion to hydride)

Quantity Value Units Method Reference Comment
Δr14.2kcal/molPHPMSMeot-Ner M. and Sieck, 1983gas phase
Quantity Value Units Method Reference Comment
Δr28.8cal/mol*KPHPMSMeot-Ner M. and Sieck, 1983gas phase

C8H12N+ + Pyridine, 2-(1-methylethyl)- = (C8H12N+ • Pyridine, 2-(1-methylethyl)-)

By formula: C8H12N+ + C8H11N = (C8H12N+ • C8H11N)

Quantity Value Units Method Reference Comment
Δr23.0kcal/molPHPMSMeot-Ner M. and Sieck, 1983gas phase
Quantity Value Units Method Reference Comment
Δr32.7cal/mol*KPHPMSMeot-Ner M. and Sieck, 1983gas phase

References

Meot-Ner M. and Sieck, 1983
Meot-Ner M.; Sieck, L.W., The Ionic Hydrogen Bond. 1. Sterically Hindered Bonds. Solvation and Clustering of Sterically Hindered Amines and Pyridines, J. Am. Chem. Soc., 1983, 105, 10, 2956, https://doi.org/10.1021/ja00348a005 . [all data]