Benzenamine, N,N-dimethyl-, positive ion

Reaction thermochemistry data

Data compiled by: Michael M. Meot-Ner (Mautner) and Sharon G. Lias

Individual Reactions

C8H11N+ + Benzenamine, N,N-dimethyl- = (C8H11N+ • Benzenamine, N,N-dimethyl-)

By formula: C8H11N+ + C8H11N = (C8H11N+ • C8H11N)

Bond type: Charge transfer bond (positive ion)

Quantity Value Units Method Reference Comment
Δr66.5kJ/molPHPMSMeot-Ner (Mautner) and El-Shall, 1986gas phase; Entropy change calculated or estimated
Quantity Value Units Method Reference Comment
Δr110.J/mol*KN/AMeot-Ner (Mautner) and El-Shall, 1986gas phase; Entropy change calculated or estimated

Free energy of reaction

ΔrG° (kJ/mol) T (K) Method Reference Comment
33.304.PHPMSMeot-Ner (Mautner) and El-Shall, 1986gas phase; Entropy change calculated or estimated

C8H11N+ + Aniline = (C8H11N+ • Aniline)

By formula: C8H11N+ + C6H7N = (C8H11N+ • C6H7N)

Bond type: Charge transfer bond (positive ion)

Quantity Value Units Method Reference Comment
Δr59.4kJ/molPHPMSMeot-Ner (Mautner) and El-Shall, 1986gas phase; Entropy change calculated or estimated
Quantity Value Units Method Reference Comment
Δr110.J/mol*KN/AMeot-Ner (Mautner) and El-Shall, 1986gas phase; Entropy change calculated or estimated
Quantity Value Units Method Reference Comment
Δr27.kJ/molPHPMSMeot-Ner (Mautner) and El-Shall, 1986gas phase; Entropy change calculated or estimated

C8H11N+ + Benzene = (C8H11N+ • Benzene)

By formula: C8H11N+ + C6H6 = (C8H11N+ • C6H6)

Bond type: Charge transfer bond (positive ion)

Quantity Value Units Method Reference Comment
Δr41.8kJ/molPHPMSMeot-Ner (Mautner) and El-Shall, 1986gas phase; Entropy change calculated or estimated
Quantity Value Units Method Reference Comment
Δr110.J/mol*KN/AMeot-Ner (Mautner) and El-Shall, 1986gas phase; Entropy change calculated or estimated
Quantity Value Units Method Reference Comment
Δr9.2kJ/molPHPMSMeot-Ner (Mautner) and El-Shall, 1986gas phase; Entropy change calculated or estimated

Ion clustering data

Data compiled by: Michael M. Meot-Ner (Mautner) and Sharon G. Lias

Clustering reactions

C8H11N+ + Benzene = (C8H11N+ • Benzene)

By formula: C8H11N+ + C6H6 = (C8H11N+ • C6H6)

Bond type: Charge transfer bond (positive ion)

Quantity Value Units Method Reference Comment
Δr41.8kJ/molPHPMSMeot-Ner (Mautner) and El-Shall, 1986gas phase; Entropy change calculated or estimated
Quantity Value Units Method Reference Comment
Δr110.J/mol*KN/AMeot-Ner (Mautner) and El-Shall, 1986gas phase; Entropy change calculated or estimated
Quantity Value Units Method Reference Comment
Δr9.2kJ/molPHPMSMeot-Ner (Mautner) and El-Shall, 1986gas phase; Entropy change calculated or estimated

C8H11N+ + Aniline = (C8H11N+ • Aniline)

By formula: C8H11N+ + C6H7N = (C8H11N+ • C6H7N)

Bond type: Charge transfer bond (positive ion)

Quantity Value Units Method Reference Comment
Δr59.4kJ/molPHPMSMeot-Ner (Mautner) and El-Shall, 1986gas phase; Entropy change calculated or estimated
Quantity Value Units Method Reference Comment
Δr110.J/mol*KN/AMeot-Ner (Mautner) and El-Shall, 1986gas phase; Entropy change calculated or estimated
Quantity Value Units Method Reference Comment
Δr27.kJ/molPHPMSMeot-Ner (Mautner) and El-Shall, 1986gas phase; Entropy change calculated or estimated

C8H11N+ + Benzenamine, N,N-dimethyl- = (C8H11N+ • Benzenamine, N,N-dimethyl-)

By formula: C8H11N+ + C8H11N = (C8H11N+ • C8H11N)

Bond type: Charge transfer bond (positive ion)

Quantity Value Units Method Reference Comment
Δr66.5kJ/molPHPMSMeot-Ner (Mautner) and El-Shall, 1986gas phase; Entropy change calculated or estimated
Quantity Value Units Method Reference Comment
Δr110.J/mol*KN/AMeot-Ner (Mautner) and El-Shall, 1986gas phase; Entropy change calculated or estimated

Free energy of reaction

ΔrG° (kJ/mol) T (K) Method Reference Comment
33.304.PHPMSMeot-Ner (Mautner) and El-Shall, 1986gas phase; Entropy change calculated or estimated

References

Meot-Ner (Mautner) and El-Shall, 1986
Meot-Ner (Mautner), M.; El-Shall, M.S., Ionic Charge Transfer Complexes. 1. Cationic Complexes with Delocalized and Partially Localized pi Systems, J. Am. Chem. Soc., 1986, 108, 15, 4386, https://doi.org/10.1021/ja00275a026 . [all data]