p-Xylene, positive ion

Reaction thermochemistry data

Data compiled by: Michael M. Meot-Ner (Mautner) and Sharon G. Lias

Individual Reactions

C8H10+ + p-Xylene = (C8H10+ • p-Xylene)

By formula: C8H10+ + C8H10 = (C8H10+ • C8H10)

Bond type: Charge transfer bond (positive ion)

Quantity Value Units Method Reference Comment
Δr65.3kJ/molPHPMSMeot-Ner (Mautner), Hamlet, et al., 1978gas phase
Quantity Value Units Method Reference Comment
Δr130.J/mol*KPHPMSMeot-Ner (Mautner), Hamlet, et al., 1978gas phase

References

Meot-Ner (Mautner), Hamlet, et al., 1978
Meot-Ner (Mautner), M.; Hamlet, P.; Hunter, E.P.; Field, F.H., Bonding Energies in Association Ions of Aromatic Molecules. Correlations with Ionization Energies, J. Am. Chem. Soc., 1978, 100, 17, 5466, https://doi.org/10.1021/ja00485a034 . [all data]