Toluene, positive ion

Reaction thermochemistry data

Data compiled by: Michael M. Meot-Ner (Mautner) and Sharon G. Lias

Individual Reactions

C7H8+ + Toluene = (C7H8+ • Toluene)

By formula: C7H8+ + C7H8 = (C7H8+ • C7H8)

Bond type: Charge transfer bond (positive ion)

Quantity Value Units Method Reference Comment
Δr14.5kcal/molMPIErnstberger, Krause, et al., 1990gas phase
Δr5.4kcal/molPIRuhl, Bisling, et al., 1986gas phase; from vIP of perpendicular dimer
Δr16.0kcal/molPHPMSMeot-Ner (Mautner), Hamlet, et al., 1978gas phase
Quantity Value Units Method Reference Comment
Δr29.cal/mol*KPHPMSMeot-Ner (Mautner), Hamlet, et al., 1978gas phase

C7H8+ + Benzene = (C7H8+ • Benzene)

By formula: C7H8+ + C6H6 = (C7H8+ • C6H6)

Bond type: Charge transfer bond (positive ion)

Quantity Value Units Method Reference Comment
Δr12.2kcal/molMPIErnstberger, Krause, et al., 1990gas phase
Δr5.5kcal/molPIRuhl, Bisling, et al., 1986gas phase; from vIP of perpendicular dimer
Δr12.4kcal/molPHPMSMeot-Ner (Mautner), Hamlet, et al., 1978gas phase
Quantity Value Units Method Reference Comment
Δr26.cal/mol*KPHPMSMeot-Ner (Mautner), Hamlet, et al., 1978gas phase

C7H8+ + Benzene, fluoro- = (C7H8+ • Benzene, fluoro-)

By formula: C7H8+ + C6H5F = (C7H8+ • C6H5F)

Bond type: Charge transfer bond (positive ion)

Quantity Value Units Method Reference Comment
Δr3.9kcal/molPIRuhl, Bisling, et al., 1986gas phase; from vIP of perpendicular dimer

References

Ernstberger, Krause, et al., 1990
Ernstberger, B.; Krause, H.; Kiermeier, A.; Neusser, H.J., Multiphoton ionization and dissociation of mixed van der Waals clusters in a linear reflectron time-of-flight mass spectrometer, J. Chem. Phys., 1990, 92, 9, 5285, https://doi.org/10.1063/1.458603 . [all data]

Ruhl, Bisling, et al., 1986
Ruhl, E.; Bisling, P.G.F.; Brutschy, B.; Baumgartel, H., Photoionization of Aromatic van der Waals Complexes in a Supersonic Jet, Chem. Phys. Lett., 1986, 126, 3-4, 232, https://doi.org/10.1016/S0009-2614(86)80075-6 . [all data]

Meot-Ner (Mautner), Hamlet, et al., 1978
Meot-Ner (Mautner), M.; Hamlet, P.; Hunter, E.P.; Field, F.H., Bonding Energies in Association Ions of Aromatic Molecules. Correlations with Ionization Energies, J. Am. Chem. Soc., 1978, 100, 17, 5466, https://doi.org/10.1021/ja00485a034 . [all data]