Benzoic acid, 2-hyroxy, protonated

Reaction thermochemistry data

Data compiled by: Michael M. Meot-Ner (Mautner) and Sharon G. Lias

Individual Reactions

C7H7O3+ + Water = (C7H7O3+ • Water)

By formula: C7H7O3+ + H2O = (C7H7O3+ • H2O)

Bond type: Hydrogen bond (positive ion to hydride)

Free energy of reaction

ΔrG° (kJ/mol) T (K) Method Reference Comment
23.452.PHPMSMartinsen and Buttrill, 1978gas phase

References

Martinsen and Buttrill, 1978
Martinsen, D.P.; Buttrill, S.E., Hydrogen Bonding of Water to Gas - Phase Ions. Structural and Stereochemical Effects in Protonated Phenols, J. Am. Chem. Soc., 1978, 100, 21, 6559, https://doi.org/10.1021/ja00489a002 . [all data]