Acetic acid, 3-methylbutyl ester, protonated

Reaction thermochemistry data

Data compiled by: Michael M. Meot-Ner (Mautner) and Sharon G. Lias

Individual Reactions

C7H15O2+ + 1-Butanol, 3-methyl-, acetate = (C7H15O2+ • 1-Butanol, 3-methyl-, acetate)

By formula: C7H15O2+ + C7H14O2 = (C7H15O2+ • C7H14O2)

Bond type: Hydrogen bonds of the type OH-O between organics

Quantity Value Units Method Reference Comment
Δr38.kJ/molHPMSField, 1969gas phase; Entropy change is questionable
Quantity Value Units Method Reference Comment
Δr-8.J/mol*KHPMSField, 1969gas phase; Entropy change is questionable

C7H15O2+ + Water = (C7H15O2+ • Water)

By formula: C7H15O2+ + H2O = (C7H15O2+ • H2O)

Bond type: Hydrogen bond (positive ion to hydride)

Quantity Value Units Method Reference Comment
Δr57.7kJ/molHPMSField, 1969gas phase; Entropy change is questionable
Quantity Value Units Method Reference Comment
Δr50.J/mol*KHPMSField, 1969gas phase; Entropy change is questionable

Ion clustering data

Data compiled by: Michael M. Meot-Ner (Mautner) and Sharon G. Lias

Clustering reactions

C7H15O2+ + 1-Butanol, 3-methyl-, acetate = (C7H15O2+ • 1-Butanol, 3-methyl-, acetate)

By formula: C7H15O2+ + C7H14O2 = (C7H15O2+ • C7H14O2)

Bond type: Hydrogen bonds of the type OH-O between organics

Quantity Value Units Method Reference Comment
Δr38.kJ/molHPMSField, 1969gas phase; Entropy change is questionable
Quantity Value Units Method Reference Comment
Δr-8.J/mol*KHPMSField, 1969gas phase; Entropy change is questionable

C7H15O2+ + Water = (C7H15O2+ • Water)

By formula: C7H15O2+ + H2O = (C7H15O2+ • H2O)

Bond type: Hydrogen bond (positive ion to hydride)

Quantity Value Units Method Reference Comment
Δr57.7kJ/molHPMSField, 1969gas phase; Entropy change is questionable
Quantity Value Units Method Reference Comment
Δr50.J/mol*KHPMSField, 1969gas phase; Entropy change is questionable

References

Field, 1969
Field, F.H., Chemical Ionization Mass Spectrometry. IX. Temperature and Pressure Studies with Benzyl Acetate and t-Amyl Acetate, J. Am. Chem. Soc., 1969, 91, 11, 2827, https://doi.org/10.1021/ja01039a002 . [all data]