Norbornyl, positive ion

Reaction thermochemistry data

Data compiled by: Michael M. Meot-Ner (Mautner) and Sharon G. Lias

Individual Reactions

C6H11+ + Methylene chloride = (C6H11+ • Methylene chloride)

By formula: C6H11+ + CH2Cl2 = (C6H11+ • CH2Cl2)

Quantity Value Units Method Reference Comment
Δr10.6kcal/molPHPMSSharma, Meza de Hojer, et al., 1985gas phase
Quantity Value Units Method Reference Comment
Δr31.1cal/mol*KPHPMSSharma, Meza de Hojer, et al., 1985gas phase

References

Sharma, Meza de Hojer, et al., 1985
Sharma, D.M.S.; Meza de Hojer, S.; Kebarle, P., Stabilities of halonium ions from a study of gas-phase equilibria R+ + XR' = (RXR')+, J. Am. Chem. Soc., 1985, 107, 13, 3757, https://doi.org/10.1021/ja00299a002 . [all data]