Pyridine, 2,6-dimethyl-, protonated

Reaction thermochemistry data

Data compiled by: Michael M. Meot-Ner (Mautner) and Sharon G. Lias

Individual Reactions

C7H10N+ + Water = (C7H10N+ • Water)

By formula: C7H10N+ + H2O = (C7H10N+ • H2O)

Bond type: Hydrogen bond (positive ion to hydride)

Quantity Value Units Method Reference Comment
Δr13.2kcal/molPHPMSMeot-Ner M. and Sieck, 1983gas phase
Quantity Value Units Method Reference Comment
Δr25.9cal/mol*KPHPMSMeot-Ner M. and Sieck, 1983gas phase

C7H10N+ + 2,6-Lutidine = (C7H10N+ • 2,6-Lutidine)

By formula: C7H10N+ + C7H9N = (C7H10N+ • C7H9N)

Quantity Value Units Method Reference Comment
Δr23.3kcal/molPHPMSMeot-Ner M. and Sieck, 1983gas phase
Quantity Value Units Method Reference Comment
Δr33.2cal/mol*KPHPMSMeot-Ner M. and Sieck, 1983gas phase

References

Meot-Ner M. and Sieck, 1983
Meot-Ner M.; Sieck, L.W., The Ionic Hydrogen Bond. 1. Sterically Hindered Bonds. Solvation and Clustering of Sterically Hindered Amines and Pyridines, J. Am. Chem. Soc., 1983, 105, 10, 2956, https://doi.org/10.1021/ja00348a005 . [all data]