Chromium hexacarbonyl, protonated

Reaction thermochemistry data

Data compiled by: Michael M. Meot-Ner (Mautner) and Sharon G. Lias

Individual Reactions

C6HCrO6+ + Ethylene = (C6HCrO6+ • Ethylene)

By formula: C6HCrO6+ + C2H4 = (C6HCrO6+ • C2H4)

Quantity Value Units Method Reference Comment
Δr59.8 ± 5.0kJ/molICRCDHop and McMahon, 1991gas phase; Ar collision gas

Ion clustering data

Data compiled by: Michael M. Meot-Ner (Mautner) and Sharon G. Lias

Clustering reactions

C6HCrO6+ + Ethylene = (C6HCrO6+ • Ethylene)

By formula: C6HCrO6+ + C2H4 = (C6HCrO6+ • C2H4)

Quantity Value Units Method Reference Comment
Δr59.8 ± 5.0kJ/molICRCDHop and McMahon, 1991gas phase; Ar collision gas

References

Hop and McMahon, 1991
Hop, C.E.C.A.; McMahon, T.B., High Pressure Mass Spectrometric Observation of Metal Carbonyl Alkyl Adduct Ions of Novel Structure, Inorg. Chem., 1991, 30, 13, 2828, https://doi.org/10.1021/ic00013a025 . [all data]