1,3-Benzenediamine, protonated

Reaction thermochemistry data

Data compiled by: Michael M. Meot-Ner (Mautner) and Sharon G. Lias

Individual Reactions

C6H9N2+ + Water = (C6H9N2+ • Water)

By formula: C6H9N2+ + H2O = (C6H9N2+ • H2O)

Bond type: Hydrogen bond (positive ion to hydride)

Quantity Value Units Method Reference Comment
Δr41.kJ/molPHPMSLau, Nishizawa, et al., 1981gas phase; Entropy change calculated or estimated, ring protonated
Quantity Value Units Method Reference Comment
Δr92.J/mol*KN/ALau, Nishizawa, et al., 1981gas phase; Entropy change calculated or estimated, ring protonated

Free energy of reaction

ΔrG° (kJ/mol) T (K) Method Reference Comment
2.433.PHPMSLau, Nishizawa, et al., 1981gas phase; Entropy change calculated or estimated, ring protonated

References

Lau, Nishizawa, et al., 1981
Lau, Y.K.; Nishizawa, K.; Tse, A.; Brown, R.S.; Kebarle, P., Protonation and Site of Protonation in Anilines. Hydration and Site of Protonation after Hydration, J. Am. Chem. Soc., 1981, 103, 21, 6291, https://doi.org/10.1021/ja00411a004 . [all data]