Pyridine, 4-methyl-, protonated

Reaction thermochemistry data

Data compiled by: Michael M. Meot-Ner (Mautner) and Sharon G. Lias

Individual Reactions

C6H8N+ + Water = (C6H8N+ • Water)

By formula: C6H8N+ + H2O = (C6H8N+ • H2O)

Bond type: Hydrogen bond (positive ion to hydride)

Quantity Value Units Method Reference Comment
Δr14.7kcal/molPHPMSDavidson, Sunner J., et al., 1979gas phase
Quantity Value Units Method Reference Comment
Δr26.6cal/mol*KPHPMSDavidson, Sunner J., et al., 1979gas phase

References

Davidson, Sunner J., et al., 1979
Davidson, W.R.; Sunner J.; Kebarle, P., Hydrogen Bonding of Water to Onium Ions. Hydration of Substituted Pyridinium Ions and Related Systems, J. Am. Chem. Soc., 1979, 101, 7, 1675, https://doi.org/10.1021/ja00501a005 . [all data]