3-Chloroaniline, protonated

Reaction thermochemistry data

Data compiled by: Michael M. Meot-Ner (Mautner) and Sharon G. Lias

Individual Reactions

C6H7ClN+ + Water = (C6H7ClN+ • Water)

By formula: C6H7ClN+ + H2O = (C6H7ClN+ • H2O)

Bond type: Hydrogen bond (positive ion to hydride)

Quantity Value Units Method Reference Comment
Δr61.9kJ/molPHPMSLau, Nishizawa, et al., 1981gas phase; Entropy change calculated or estimated
Quantity Value Units Method Reference Comment
Δr92.J/mol*KN/ALau, Nishizawa, et al., 1981gas phase; Entropy change calculated or estimated

Free energy of reaction

ΔrG° (kJ/mol) T (K) Method Reference Comment
22.433.PHPMSLau, Nishizawa, et al., 1981gas phase; Entropy change calculated or estimated

References

Lau, Nishizawa, et al., 1981
Lau, Y.K.; Nishizawa, K.; Tse, A.; Brown, R.S.; Kebarle, P., Protonation and Site of Protonation in Anilines. Hydration and Site of Protonation after Hydration, J. Am. Chem. Soc., 1981, 103, 21, 6291, https://doi.org/10.1021/ja00411a004 . [all data]