1,6-Hexanediamine, diprotonated

Reaction thermochemistry data

Data compiled by: Michael M. Meot-Ner (Mautner) and Sharon G. Lias

Individual Reactions

(C6H18N2+2 • Water) + Water = (C6H18N2+2 • 2Water)

By formula: (C6H18N2+2 • H2O) + H2O = (C6H18N2+2 • 2H2O)

Bond type: Hydrogen bond (positive ion to hydride)

Quantity Value Units Method Reference Comment
Δr72.0kJ/molES/HPMSBlades, Klassen, et al., 1996gas phase
Quantity Value Units Method Reference Comment
Δr96.7J/mol*KES/HPMSBlades, Klassen, et al., 1996gas phase
Quantity Value Units Method Reference Comment
Δr43.5kJ/molES/HPMSBlades, Klassen, et al., 1996gas phase

C6H18N2+2 + Water = (C6H18N2+2 • Water)

By formula: C6H18N2+2 + H2O = (C6H18N2+2 • H2O)

Bond type: Hydrogen bond (positive ion to hydride)

Quantity Value Units Method Reference Comment
Δr74.5kJ/molES/HPMSBlades, Klassen, et al., 1996gas phase
Quantity Value Units Method Reference Comment
Δr87.9J/mol*KES/HPMSBlades, Klassen, et al., 1996gas phase
Quantity Value Units Method Reference Comment
Δr48.1kJ/molES/HPMSBlades, Klassen, et al., 1996gas phase

References

Blades, Klassen, et al., 1996
Blades, A.T.; Klassen, J.S.; Kebarle, P., Determination of Ion-Solvent Equilibria in the Gas Phase. Hydration of Diprotonated Diamines and Bis(trimethylammonium) Alkanes, J. Am. Chem. Soc., 1996, 118, 49, 12437, https://doi.org/10.1021/ja962641t . [all data]