Triethanolamine, protonated

Reaction thermochemistry data

Data compiled by: Michael M. Meot-Ner (Mautner) and Sharon G. Lias

Individual Reactions

C6H16NO3+ + Triethanolamine = (C6H16NO3+ • Triethanolamine)

By formula: C6H16NO3+ + C6H15NO3 = (C6H16NO3+ • C6H15NO3)

Free energy of reaction

ΔrG° (kJ/mol) T (K) Method Reference Comment
27.500.PHPMSSunner, Kulatunga, et al., 1986gas phase

References

Sunner, Kulatunga, et al., 1986
Sunner, J.A.; Kulatunga, R.; Kebarle, P., Fast Atom Bombardment Mass Spectrometry and Gas Phase Basicities, Anal. Chem., 1986, 58, 7, 1312, https://doi.org/10.1021/ac00298a010 . [all data]