Triethylamine, protonated

Ion clustering data

Data compiled by: Michael M. Meot-Ner (Mautner) and Sharon G. Lias

Clustering reactions

C6H16N+ + Triethylamine = (C6H16N+ • Triethylamine)

By formula: C6H16N+ + C6H15N = (C6H16N+ • C6H15N)

Quantity Value Units Method Reference Comment
Δr99.6kJ/molPHPMSMeot-Ner M. and Sieck, 1983gas phase
Quantity Value Units Method Reference Comment
Δr172.J/mol*KPHPMSMeot-Ner M. and Sieck, 1983gas phase

C6H16N+ + Water = (C6H16N+ • Water)

By formula: C6H16N+ + H2O = (C6H16N+ • H2O)

Bond type: Hydrogen bond (positive ion to hydride)

Quantity Value Units Method Reference Comment
Δr55.2kJ/molPHPMSMeot-Ner M. and Sieck, 1983gas phase
Quantity Value Units Method Reference Comment
Δr114.J/mol*KPHPMSMeot-Ner M. and Sieck, 1983gas phase

References

Meot-Ner M. and Sieck, 1983
Meot-Ner M.; Sieck, L.W., The Ionic Hydrogen Bond. 1. Sterically Hindered Bonds. Solvation and Clustering of Sterically Hindered Amines and Pyridines, J. Am. Chem. Soc., 1983, 105, 10, 2956, https://doi.org/10.1021/ja00348a005 . [all data]