Dipropyl sulfide, protonated

Reaction thermochemistry data

Data compiled by: Michael M. Meot-Ner (Mautner) and Sharon G. Lias

Individual Reactions

C6H15S+ + Water = (C6H15S+ • Water)

By formula: C6H15S+ + H2O = (C6H15S+ • H2O)

Quantity Value Units Method Reference Comment
Δr51.0kJ/molPHPMSMeot-Ner (Mautner) and Sieck, 1985gas phase
Quantity Value Units Method Reference Comment
Δr108.J/mol*KPHPMSMeot-Ner (Mautner) and Sieck, 1985gas phase

Ion clustering data

Data compiled by: Michael M. Meot-Ner (Mautner) and Sharon G. Lias

Clustering reactions

C6H15S+ + Water = (C6H15S+ • Water)

By formula: C6H15S+ + H2O = (C6H15S+ • H2O)

Quantity Value Units Method Reference Comment
Δr51.0kJ/molPHPMSMeot-Ner (Mautner) and Sieck, 1985gas phase
Quantity Value Units Method Reference Comment
Δr108.J/mol*KPHPMSMeot-Ner (Mautner) and Sieck, 1985gas phase

References

Meot-Ner (Mautner) and Sieck, 1985
Meot-Ner (Mautner), M.; Sieck, L.W., The Ionic Hydrogen Bond and Ion Solvation. 4. SH+ O and NH+ S Bonds. Correlations with Proton Affinity. Mutual Effects of Weak and Strong Ligands in Mixed Clusters, J. Phys. Chem., 1985, 89, 24, 5222, https://doi.org/10.1021/j100270a021 . [all data]