Ethane, 1,1'-oxybis[2-methoxy-, protonated

Ion clustering data

Data compiled by: Michael M. Meot-Ner (Mautner) and Sharon G. Lias

Clustering reactions

C6H15O3+ + Ethane, 1,1'-oxybis[2-methoxy- = (C6H15O3+ • Ethane, 1,1'-oxybis[2-methoxy-)

By formula: C6H15O3+ + C6H14O3 = (C6H15O3+ • C6H14O3)

Bond type: Hydrogen bonds between protonated and neutral organics

Quantity Value Units Method Reference Comment
Δr89.1kJ/molPHPMSMeot-Ner (Mautner), Sieck, et al., 1994gas phase
Quantity Value Units Method Reference Comment
Δr159.J/mol*KPHPMSMeot-Ner (Mautner), Sieck, et al., 1994gas phase

(C6H15O3+ • Ethane, 1,1'-oxybis[2-methoxy-) + Water = (C6H15O3+ • Water • Ethane, 1,1'-oxybis[2-methoxy-)

By formula: (C6H15O3+ • C6H14O3) + H2O = (C6H15O3+ • H2O • C6H14O3)

Bond type: Hydrogen bond (positive ion to hydride)

Quantity Value Units Method Reference Comment
Δr86.2kJ/molPHPMSMeot-Ner (Mautner), Sieck, et al., 1994gas phase
Quantity Value Units Method Reference Comment
Δr145.J/mol*KPHPMSMeot-Ner (Mautner), Sieck, et al., 1994gas phase

C6H15O3+ + Water = (C6H15O3+ • Water)

By formula: C6H15O3+ + H2O = (C6H15O3+ • H2O)

Bond type: Hydrogen bond (positive ion to hydride)

Quantity Value Units Method Reference Comment
Δr73.6kJ/molPHPMSMeot-Ner (Mautner), Sieck, et al., 1994gas phase
Quantity Value Units Method Reference Comment
Δr146.J/mol*KPHPMSMeot-Ner (Mautner), Sieck, et al., 1994gas phase

(C6H15O3+ • Water) + Water = (C6H15O3+ • 2Water)

By formula: (C6H15O3+ • H2O) + H2O = (C6H15O3+ • 2H2O)

Bond type: Hydrogen bond (positive ion to hydride)

Quantity Value Units Method Reference Comment
Δr54.8kJ/molPHPMSMeot-Ner (Mautner), Sieck, et al., 1994gas phase
Quantity Value Units Method Reference Comment
Δr97.1J/mol*KPHPMSMeot-Ner (Mautner), Sieck, et al., 1994gas phase

(C6H15O3+ • 2Water) + Water = (C6H15O3+ • 3Water)

By formula: (C6H15O3+ • 2H2O) + H2O = (C6H15O3+ • 3H2O)

Bond type: Hydrogen bond (positive ion to hydride)

Quantity Value Units Method Reference Comment
Δr42.7kJ/molPHPMSMeot-Ner (Mautner), Sieck, et al., 1994gas phase; DG<=, ΔrH<=, (ΔrS)
Quantity Value Units Method Reference Comment
Δr105.J/mol*KPHPMSMeot-Ner (Mautner), Sieck, et al., 1994gas phase; DG<=, ΔrH<=, (ΔrS)

Free energy of reaction

ΔrG° (kJ/mol) T (K) Method Reference Comment
16.257.PHPMSMeot-Ner (Mautner), Sieck, et al., 1994gas phase; DG<=, ΔrH<=, (ΔrS)

C6H15O3+ + Ammonia = (C6H15O3+ • Ammonia)

By formula: C6H15O3+ + H3N = (C6H15O3+ • H3N)

Bond type: Hydrogen bond (positive ion to hydride)

Quantity Value Units Method Reference Comment
Δr127.kJ/molPHPMSMeot-Ner (Mautner), Sieck, et al., 1996gas phase
Quantity Value Units Method Reference Comment
Δr117.J/mol*KPHPMSMeot-Ner (Mautner), Sieck, et al., 1996gas phase

(C6H15O3+ • Ammonia) + Ethane, 1,1'-oxybis[2-methoxy- = (C6H15O3+ • Ethane, 1,1'-oxybis[2-methoxy- • Ammonia)

By formula: (C6H15O3+ • H3N) + C6H14O3 = (C6H15O3+ • C6H14O3 • H3N)

Bond type: Hydrogen bonds between protonated and neutral organics

Quantity Value Units Method Reference Comment
Δr128.kJ/molPHPMSMeot-Ner (Mautner), Sieck, et al., 1996gas phase
Quantity Value Units Method Reference Comment
Δr213.J/mol*KPHPMSMeot-Ner (Mautner), Sieck, et al., 1996gas phase

Reaction thermochemistry data

Data compiled by: Michael M. Meot-Ner (Mautner) and Sharon G. Lias

Individual Reactions

(C6H15O3+ • 2Water) + Water = (C6H15O3+ • 3Water)

By formula: (C6H15O3+ • 2H2O) + H2O = (C6H15O3+ • 3H2O)

Bond type: Hydrogen bond (positive ion to hydride)

Quantity Value Units Method Reference Comment
Δr10.2kcal/molPHPMSMeot-Ner (Mautner), Sieck, et al., 1994gas phase; DG<=, ΔrH<=, (ΔrS)
Quantity Value Units Method Reference Comment
Δr25.0cal/mol*KPHPMSMeot-Ner (Mautner), Sieck, et al., 1994gas phase; DG<=, ΔrH<=, (ΔrS)

Free energy of reaction

ΔrG° (kcal/mol) T (K) Method Reference Comment
3.8257.PHPMSMeot-Ner (Mautner), Sieck, et al., 1994gas phase; DG<=, ΔrH<=, (ΔrS)

(C6H15O3+ • Ammonia) + Ethane, 1,1'-oxybis[2-methoxy- = (C6H15O3+ • Ethane, 1,1'-oxybis[2-methoxy- • Ammonia)

By formula: (C6H15O3+ • H3N) + C6H14O3 = (C6H15O3+ • C6H14O3 • H3N)

Bond type: Hydrogen bonds between protonated and neutral organics

Quantity Value Units Method Reference Comment
Δr30.5kcal/molPHPMSMeot-Ner (Mautner), Sieck, et al., 1996gas phase
Quantity Value Units Method Reference Comment
Δr50.9cal/mol*KPHPMSMeot-Ner (Mautner), Sieck, et al., 1996gas phase

(C6H15O3+ • Ethane, 1,1'-oxybis[2-methoxy-) + Water = (C6H15O3+ • Water • Ethane, 1,1'-oxybis[2-methoxy-)

By formula: (C6H15O3+ • C6H14O3) + H2O = (C6H15O3+ • H2O • C6H14O3)

Bond type: Hydrogen bond (positive ion to hydride)

Quantity Value Units Method Reference Comment
Δr20.6kcal/molPHPMSMeot-Ner (Mautner), Sieck, et al., 1994gas phase
Quantity Value Units Method Reference Comment
Δr34.7cal/mol*KPHPMSMeot-Ner (Mautner), Sieck, et al., 1994gas phase

C6H15O3+ + Ethane, 1,1'-oxybis[2-methoxy- = (C6H15O3+ • Ethane, 1,1'-oxybis[2-methoxy-)

By formula: C6H15O3+ + C6H14O3 = (C6H15O3+ • C6H14O3)

Bond type: Hydrogen bonds between protonated and neutral organics

Quantity Value Units Method Reference Comment
Δr21.3kcal/molPHPMSMeot-Ner (Mautner), Sieck, et al., 1994gas phase
Quantity Value Units Method Reference Comment
Δr38.0cal/mol*KPHPMSMeot-Ner (Mautner), Sieck, et al., 1994gas phase

(C6H15O3+ • Water) + Water = (C6H15O3+ • 2Water)

By formula: (C6H15O3+ • H2O) + H2O = (C6H15O3+ • 2H2O)

Bond type: Hydrogen bond (positive ion to hydride)

Quantity Value Units Method Reference Comment
Δr13.1kcal/molPHPMSMeot-Ner (Mautner), Sieck, et al., 1994gas phase
Quantity Value Units Method Reference Comment
Δr23.2cal/mol*KPHPMSMeot-Ner (Mautner), Sieck, et al., 1994gas phase

C6H15O3+ + Ammonia = (C6H15O3+ • Ammonia)

By formula: C6H15O3+ + H3N = (C6H15O3+ • H3N)

Bond type: Hydrogen bond (positive ion to hydride)

Quantity Value Units Method Reference Comment
Δr30.4kcal/molPHPMSMeot-Ner (Mautner), Sieck, et al., 1996gas phase
Quantity Value Units Method Reference Comment
Δr27.9cal/mol*KPHPMSMeot-Ner (Mautner), Sieck, et al., 1996gas phase

C6H15O3+ + Water = (C6H15O3+ • Water)

By formula: C6H15O3+ + H2O = (C6H15O3+ • H2O)

Bond type: Hydrogen bond (positive ion to hydride)

Quantity Value Units Method Reference Comment
Δr17.6kcal/molPHPMSMeot-Ner (Mautner), Sieck, et al., 1994gas phase
Quantity Value Units Method Reference Comment
Δr35.0cal/mol*KPHPMSMeot-Ner (Mautner), Sieck, et al., 1994gas phase

References

Meot-Ner (Mautner), Sieck, et al., 1994
Meot-Ner (Mautner), M.; Sieck, L.W.; Liebman, J.F.; Scheiner, S.; Duan, X., The Ionic Hydrogen Bond. 5. Polydentate and Solvent-Bridged Structures. Complexing of the Proton and the Hydronium Ions by Polyethers, J. Am. Chem. Soc., 1994, 116, 17, 7848, https://doi.org/10.1021/ja00096a047 . [all data]

Meot-Ner (Mautner), Sieck, et al., 1996
Meot-Ner (Mautner), M.; Sieck, L.W.; Liebman, J.F.; Scheiner, S., Complexing of the Ammonium Ion by Polyethers. Comparative Complexing Thermochemistry of Ammonium, Hydronium, and Alkali Cations, J. Phys. Chem., 1996, 100, 16, 6445, https://doi.org/10.1021/jp9514943 . [all data]