Buckminsterfullerene, positive ion

Reaction thermochemistry data

Data compiled by: Michael M. Meot-Ner (Mautner) and Sharon G. Lias

Individual Reactions

C60+ + Dicarbon = (C60+ • Dicarbon)

By formula: C60+ + C2 = (C60+ • C2)

Quantity Value Units Method Reference Comment
Δr444. ± 50.kJ/molMIKESRadi, Hsu, et al., 1990gas phase

Ion clustering data

Data compiled by: Michael M. Meot-Ner (Mautner) and Sharon G. Lias

Clustering reactions

C60+ + Dicarbon = (C60+ • Dicarbon)

By formula: C60+ + C2 = (C60+ • C2)

Quantity Value Units Method Reference Comment
Δr444. ± 50.kJ/molMIKESRadi, Hsu, et al., 1990gas phase

References

Radi, Hsu, et al., 1990
Radi, P.R.; Hsu, M.T.; Rincon, M.E.; Kemper, P.R.; Bowers, M.T., On the Structure, Reactivity and Relative Stability of the Large Carbon Cluster Ions C62+, C60+ and C58+, Chem. Phys. Lett., 1990, 174, 3-4, 223, https://doi.org/10.1016/0009-2614(90)85336-B . [all data]