Iron pentacarbonyl, protonated

Ion clustering data

Data compiled by: Michael M. Meot-Ner (Mautner) and Sharon G. Lias

Clustering reactions

C5HFeO5+ + Acetonitrile = (C5HFeO5+ • Acetonitrile)

By formula: C5HFeO5+ + C2H3N = (C5HFeO5+ • C2H3N)

Quantity Value Units Method Reference Comment
Δr70.3kJ/molPHPMSAllison, Cramer, et al., 1991gas phase
Quantity Value Units Method Reference Comment
Δr112.J/mol*KPHPMSAllison, Cramer, et al., 1991gas phase

Reaction thermochemistry data

Data compiled by: Michael M. Meot-Ner (Mautner) and Sharon G. Lias

Individual Reactions

C5HFeO5+ + Acetonitrile = (C5HFeO5+ • Acetonitrile)

By formula: C5HFeO5+ + C2H3N = (C5HFeO5+ • C2H3N)

Quantity Value Units Method Reference Comment
Δr16.8kcal/molPHPMSAllison, Cramer, et al., 1991gas phase
Quantity Value Units Method Reference Comment
Δr26.8cal/mol*KPHPMSAllison, Cramer, et al., 1991gas phase

References

Allison, Cramer, et al., 1991
Allison, C.E.; Cramer, J.A.; Hop, C.E.C.A.; Szulejko, J.E.; McMahon, T.B., Strong Hydrogen Bonding in Gas - Phase Ions. A High - Pressure Mass Spectrometric Study of the Proton Affinity, Proton Transfer Kinetics, and Hydrogen - Bonding Capability of Iron Pentacarbonyl, J. Am. Chem. Soc., 1991, 113, 12, 4469, https://doi.org/10.1021/ja00012a014 . [all data]