Valine, protonated

Reaction thermochemistry data

Data compiled by: Michael M. Meot-Ner (Mautner) and Sharon G. Lias

Individual Reactions

C5H12NO2+ + Water = (C5H12NO2+ • Water)

By formula: C5H12NO2+ + H2O = (C5H12NO2+ • H2O)

Quantity Value Units Method Reference Comment
Δr80.8kJ/molPHPMSMeot-Ner and Field, 1974gas phase; Entropy change is questionable
Quantity Value Units Method Reference Comment
Δr152.J/mol*KPHPMSMeot-Ner and Field, 1974gas phase; Entropy change is questionable

C5H12NO2+ + Ammonia = (C5H12NO2+ • Ammonia)

By formula: C5H12NO2+ + H3N = (C5H12NO2+ • H3N)

Quantity Value Units Method Reference Comment
Δr87.4kJ/molPHPMSMeot-Ner and Field, 1974gas phase
Quantity Value Units Method Reference Comment
Δr120.J/mol*KPHPMSMeot-Ner and Field, 1974gas phase

C5H12NO2+ + Methane, nitro- = (C5H12NO2+ • Methane, nitro-)

By formula: C5H12NO2+ + CH3NO2 = (C5H12NO2+ • CH3NO2)

Quantity Value Units Method Reference Comment
Δr82.8kJ/molHPMSMeot-Ner and Field, 1974gas phase
Quantity Value Units Method Reference Comment
Δr116.J/mol*KHPMSMeot-Ner and Field, 1974gas phase

C5H12NO2+ + DL-Valine = (C5H12NO2+ • DL-Valine)

By formula: C5H12NO2+ + C5H11NO2 = (C5H12NO2+ • C5H11NO2)

Quantity Value Units Method Reference Comment
Δr86.6kJ/molPHPMSMeot-Ner and Field, 1974gas phase

Ion clustering data

Data compiled by: Michael M. Meot-Ner (Mautner) and Sharon G. Lias

Clustering reactions

C5H12NO2+ + Methane, nitro- = (C5H12NO2+ • Methane, nitro-)

By formula: C5H12NO2+ + CH3NO2 = (C5H12NO2+ • CH3NO2)

Quantity Value Units Method Reference Comment
Δr82.8kJ/molHPMSMeot-Ner and Field, 1974gas phase
Quantity Value Units Method Reference Comment
Δr116.J/mol*KHPMSMeot-Ner and Field, 1974gas phase

C5H12NO2+ + DL-Valine = (C5H12NO2+ • DL-Valine)

By formula: C5H12NO2+ + C5H11NO2 = (C5H12NO2+ • C5H11NO2)

Quantity Value Units Method Reference Comment
Δr86.6kJ/molPHPMSMeot-Ner and Field, 1974gas phase

C5H12NO2+ + Water = (C5H12NO2+ • Water)

By formula: C5H12NO2+ + H2O = (C5H12NO2+ • H2O)

Quantity Value Units Method Reference Comment
Δr80.8kJ/molPHPMSMeot-Ner and Field, 1974gas phase; Entropy change is questionable
Quantity Value Units Method Reference Comment
Δr152.J/mol*KPHPMSMeot-Ner and Field, 1974gas phase; Entropy change is questionable

C5H12NO2+ + Ammonia = (C5H12NO2+ • Ammonia)

By formula: C5H12NO2+ + H3N = (C5H12NO2+ • H3N)

Quantity Value Units Method Reference Comment
Δr87.4kJ/molPHPMSMeot-Ner and Field, 1974gas phase
Quantity Value Units Method Reference Comment
Δr120.J/mol*KPHPMSMeot-Ner and Field, 1974gas phase

References

Meot-Ner and Field, 1974
Meot-Ner, (Mautner); Field, F.H., Solvation and Association of Protonated Gaseous Amino Acids, J. Am. Chem. Soc., 1974, 96, 10, 3168, https://doi.org/10.1021/ja00817a024 . [all data]