Tetrahydrothiophene, protonated

Ion clustering data

Data compiled by: Michael M. Meot-Ner (Mautner) and Sharon G. Lias

Clustering reactions

C4H9S+ + Thiophene, tetrahydro- = (C4H9S+ • Thiophene, tetrahydro-)

By formula: C4H9S+ + C4H8S = (C4H9S+ • C4H8S)

Quantity Value Units Method Reference Comment
Δr70.7kJ/molPHPMSHiraoka, Takimoto, et al., 1987gas phase
Quantity Value Units Method Reference Comment
Δr87.9J/mol*KPHPMSHiraoka, Takimoto, et al., 1987gas phase

(C4H9S+ • Thiophene, tetrahydro-) + Thiophene, tetrahydro- = (C4H9S+ • 2Thiophene, tetrahydro-)

By formula: (C4H9S+ • C4H8S) + C4H8S = (C4H9S+ • 2C4H8S)

Quantity Value Units Method Reference Comment
Δr33.kJ/molPHPMSHiraoka, Takimoto, et al., 1987gas phase; Entropy change calculated or estimated
Quantity Value Units Method Reference Comment
Δr75.J/mol*KN/AHiraoka, Takimoto, et al., 1987gas phase; Entropy change calculated or estimated

C4H9S+ + Water = (C4H9S+ • Water)

By formula: C4H9S+ + H2O = (C4H9S+ • H2O)

Quantity Value Units Method Reference Comment
Δr48.1kJ/molPHPMSHiraoka, Takimoto, et al., 1987gas phase
Quantity Value Units Method Reference Comment
Δr81.6J/mol*KPHPMSHiraoka, Takimoto, et al., 1987gas phase

(C4H9S+ • Water) + Water = (C4H9S+ • 2Water)

By formula: (C4H9S+ • H2O) + H2O = (C4H9S+ • 2H2O)

Quantity Value Units Method Reference Comment
Δr43.5kJ/molPHPMSHiraoka, Takimoto, et al., 1987gas phase
Quantity Value Units Method Reference Comment
Δr87.9J/mol*KPHPMSHiraoka, Takimoto, et al., 1987gas phase

References

Hiraoka, Takimoto, et al., 1987
Hiraoka, K.; Takimoto, H.; Yamabe, S., Stabilities and Structures in Cluster Ions of Five-Membered Heterocyclic Compounds Containing O, N and S Atoms, J. Am. Chem. Soc., 1987, 109, 24, 7346, https://doi.org/10.1021/ja00258a018 . [all data]