Tetrahydrofuran, protonated

Reaction thermochemistry data

Data compiled by: Michael M. Meot-Ner (Mautner) and Sharon G. Lias

Individual Reactions

C4H9O+ + Tetrahydrofuran = (C4H9O+ • Tetrahydrofuran)

By formula: C4H9O+ + C4H8O = (C4H9O+ • C4H8O)

Bond type: Hydrogen bonds of the type OH-O between organics

Quantity Value Units Method Reference Comment
Δr29.9kcal/molPHPMSHiraoka and Takimoto, 1986gas phase
Δr32.5kcal/molICRLarson and McMahon, 1982gas phase; switching reaction((CH3)2OH+)(CH3)2O, Entropy change calculated or estimated; Grimsrud and Kebarle, 1973, Lias, Liebman, et al., 1984, Keesee and Castleman, 1986
Quantity Value Units Method Reference Comment
Δr29.1cal/mol*KPHPMSHiraoka and Takimoto, 1986gas phase
Δr32.2cal/mol*KN/ALarson and McMahon, 1982gas phase; switching reaction((CH3)2OH+)(CH3)2O, Entropy change calculated or estimated; Grimsrud and Kebarle, 1973, Lias, Liebman, et al., 1984, Keesee and Castleman, 1986
Quantity Value Units Method Reference Comment
Δr22.9kcal/molICRLarson and McMahon, 1982gas phase; switching reaction((CH3)2OH+)(CH3)2O, Entropy change calculated or estimated; Grimsrud and Kebarle, 1973, Lias, Liebman, et al., 1984, Keesee and Castleman, 1986

C4H9O+ + Acetone = (C4H9O+ • Acetone)

By formula: C4H9O+ + C3H6O = (C4H9O+ • C3H6O)

Bond type: Hydrogen bonds of the type OH-O between organics

Quantity Value Units Method Reference Comment
Δr31.0kcal/molICRLarson and McMahon, 1982gas phase; switching reaction((CH3)2OH+)(CH3)2O, Entropy change calculated or estimated; Grimsrud and Kebarle, 1973, Lias, Liebman, et al., 1984, Keesee and Castleman, 1986
Quantity Value Units Method Reference Comment
Δr30.6cal/mol*KN/ALarson and McMahon, 1982gas phase; switching reaction((CH3)2OH+)(CH3)2O, Entropy change calculated or estimated; Grimsrud and Kebarle, 1973, Lias, Liebman, et al., 1984, Keesee and Castleman, 1986
Quantity Value Units Method Reference Comment
Δr21.9kcal/molICRLarson and McMahon, 1982gas phase; switching reaction((CH3)2OH+)(CH3)2O, Entropy change calculated or estimated; Grimsrud and Kebarle, 1973, Lias, Liebman, et al., 1984, Keesee and Castleman, 1986

(C4H9O+ • Tetrahydrofuran) + Tetrahydrofuran = (C4H9O+ • 2Tetrahydrofuran)

By formula: (C4H9O+ • C4H8O) + C4H8O = (C4H9O+ • 2C4H8O)

Bond type: Hydrogen bonds of the type OH-O between organics

Quantity Value Units Method Reference Comment
Δr7.6kcal/molPHPMSHiraoka, Takimoto, et al., 1987gas phase; Entropy change calculated or estimated
Quantity Value Units Method Reference Comment
Δr18.cal/mol*KN/AHiraoka, Takimoto, et al., 1987gas phase; Entropy change calculated or estimated

(C4H9O+ • Water) + Water = (C4H9O+ • 2Water)

By formula: (C4H9O+ • H2O) + H2O = (C4H9O+ • 2H2O)

Bond type: Hydrogen bond (positive ion to hydride)

Quantity Value Units Method Reference Comment
Δr13.1kcal/molPHPMSHiraoka, Takimoto, et al., 1987gas phase
Quantity Value Units Method Reference Comment
Δr24.0cal/mol*KPHPMSHiraoka, Takimoto, et al., 1987gas phase

C4H9O+ + Water = (C4H9O+ • Water)

By formula: C4H9O+ + H2O = (C4H9O+ • H2O)

Bond type: Hydrogen bond (positive ion to hydride)

Quantity Value Units Method Reference Comment
Δr19.8kcal/molPHPMSHiraoka, Takimoto, et al., 1987gas phase
Quantity Value Units Method Reference Comment
Δr25.1cal/mol*KPHPMSHiraoka, Takimoto, et al., 1987gas phase

C4H9O+ + Acetonitrile = (C4H9O+ • Acetonitrile)

By formula: C4H9O+ + C2H3N = (C4H9O+ • C2H3N)

Free energy of reaction

ΔrG° (kcal/mol) T (K) Method Reference Comment
20.7320.ICRBromilow, Abboud, et al., 1980gas phase; switching reaction,n((CH3)2OH+)(CH3)2O, Entropy change calculated or estimated; Grimsrud and Kebarle, 1973

Ion clustering data

Data compiled by: Michael M. Meot-Ner (Mautner) and Sharon G. Lias

Clustering reactions

C4H9O+ + Acetonitrile = (C4H9O+ • Acetonitrile)

By formula: C4H9O+ + C2H3N = (C4H9O+ • C2H3N)

Free energy of reaction

ΔrG° (kcal/mol) T (K) Method Reference Comment
20.7320.ICRBromilow, Abboud, et al., 1980gas phase; switching reaction,n((CH3)2OH+)(CH3)2O, Entropy change calculated or estimated; Grimsrud and Kebarle, 1973

C4H9O+ + Acetone = (C4H9O+ • Acetone)

By formula: C4H9O+ + C3H6O = (C4H9O+ • C3H6O)

Bond type: Hydrogen bonds of the type OH-O between organics

Quantity Value Units Method Reference Comment
Δr31.0kcal/molICRLarson and McMahon, 1982gas phase; switching reaction((CH3)2OH+)(CH3)2O, Entropy change calculated or estimated; Grimsrud and Kebarle, 1973, Lias, Liebman, et al., 1984, Keesee and Castleman, 1986
Quantity Value Units Method Reference Comment
Δr30.6cal/mol*KN/ALarson and McMahon, 1982gas phase; switching reaction((CH3)2OH+)(CH3)2O, Entropy change calculated or estimated; Grimsrud and Kebarle, 1973, Lias, Liebman, et al., 1984, Keesee and Castleman, 1986
Quantity Value Units Method Reference Comment
Δr21.9kcal/molICRLarson and McMahon, 1982gas phase; switching reaction((CH3)2OH+)(CH3)2O, Entropy change calculated or estimated; Grimsrud and Kebarle, 1973, Lias, Liebman, et al., 1984, Keesee and Castleman, 1986

C4H9O+ + Tetrahydrofuran = (C4H9O+ • Tetrahydrofuran)

By formula: C4H9O+ + C4H8O = (C4H9O+ • C4H8O)

Bond type: Hydrogen bonds of the type OH-O between organics

Quantity Value Units Method Reference Comment
Δr29.9kcal/molPHPMSHiraoka and Takimoto, 1986gas phase
Δr32.5kcal/molICRLarson and McMahon, 1982gas phase; switching reaction((CH3)2OH+)(CH3)2O, Entropy change calculated or estimated; Grimsrud and Kebarle, 1973, Lias, Liebman, et al., 1984, Keesee and Castleman, 1986
Quantity Value Units Method Reference Comment
Δr29.1cal/mol*KPHPMSHiraoka and Takimoto, 1986gas phase
Δr32.2cal/mol*KN/ALarson and McMahon, 1982gas phase; switching reaction((CH3)2OH+)(CH3)2O, Entropy change calculated or estimated; Grimsrud and Kebarle, 1973, Lias, Liebman, et al., 1984, Keesee and Castleman, 1986
Quantity Value Units Method Reference Comment
Δr22.9kcal/molICRLarson and McMahon, 1982gas phase; switching reaction((CH3)2OH+)(CH3)2O, Entropy change calculated or estimated; Grimsrud and Kebarle, 1973, Lias, Liebman, et al., 1984, Keesee and Castleman, 1986

(C4H9O+ • Tetrahydrofuran) + Tetrahydrofuran = (C4H9O+ • 2Tetrahydrofuran)

By formula: (C4H9O+ • C4H8O) + C4H8O = (C4H9O+ • 2C4H8O)

Bond type: Hydrogen bonds of the type OH-O between organics

Quantity Value Units Method Reference Comment
Δr7.6kcal/molPHPMSHiraoka, Takimoto, et al., 1987gas phase; Entropy change calculated or estimated
Quantity Value Units Method Reference Comment
Δr18.cal/mol*KN/AHiraoka, Takimoto, et al., 1987gas phase; Entropy change calculated or estimated

C4H9O+ + Water = (C4H9O+ • Water)

By formula: C4H9O+ + H2O = (C4H9O+ • H2O)

Bond type: Hydrogen bond (positive ion to hydride)

Quantity Value Units Method Reference Comment
Δr19.8kcal/molPHPMSHiraoka, Takimoto, et al., 1987gas phase
Quantity Value Units Method Reference Comment
Δr25.1cal/mol*KPHPMSHiraoka, Takimoto, et al., 1987gas phase

(C4H9O+ • Water) + Water = (C4H9O+ • 2Water)

By formula: (C4H9O+ • H2O) + H2O = (C4H9O+ • 2H2O)

Bond type: Hydrogen bond (positive ion to hydride)

Quantity Value Units Method Reference Comment
Δr13.1kcal/molPHPMSHiraoka, Takimoto, et al., 1987gas phase
Quantity Value Units Method Reference Comment
Δr24.0cal/mol*KPHPMSHiraoka, Takimoto, et al., 1987gas phase

References

Hiraoka and Takimoto, 1986
Hiraoka, K.; Takimoto, H., Gas-Phase Stabilities of Symmetric Proton-Held Dimer Cations, J. Phys. Chem., 1986, 90, 22, 5910, https://doi.org/10.1021/j100280a090 . [all data]

Larson and McMahon, 1982
Larson, J.W.; McMahon, T.B., Formation, Thermochemistry, and Relative Stabilities of Proton - Bound dimers of Oxygen n - Donor Bases from Ion Cyclotron Resonance Solvent - Exchange Equilibria Measurements, J. Am. Chem. Soc., 1982, 104, 23, 6255, https://doi.org/10.1021/ja00387a016 . [all data]

Grimsrud and Kebarle, 1973
Grimsrud, E.P.; Kebarle, P., Gas Phase Ion Equilibria Studies of the Solvation of the Hydrogen Ion by Methanol, Dimethyl Ether and Water. Effect of Hydrogen Bonding, J. Am. Chem. Soc., 1973, 95, 24, 7939, https://doi.org/10.1021/ja00805a002 . [all data]

Lias, Liebman, et al., 1984
Lias, S.G.; Liebman, J.F.; Levin, R.D., Evaluated gas phase basicities and proton affinities of molecules heats of formation of protonated molecules, J. Phys. Chem. Ref. Data, 1984, 13, 695. [all data]

Keesee and Castleman, 1986
Keesee, R.G.; Castleman, A.W., Jr., Thermochemical data on Ggs-phase ion-molecule association and clustering reactions, J. Phys. Chem. Ref. Data, 1986, 15, 1011. [all data]

Hiraoka, Takimoto, et al., 1987
Hiraoka, K.; Takimoto, H.; Yamabe, S., Stabilities and Structures in Cluster Ions of Five-Membered Heterocyclic Compounds Containing O, N and S Atoms, J. Am. Chem. Soc., 1987, 109, 24, 7346, https://doi.org/10.1021/ja00258a018 . [all data]

Bromilow, Abboud, et al., 1980
Bromilow, J.; Abboud, J.L.M.; Lebrilla, C.B.; Taft, R.W.; Scorrano, G.; Lucchini, V., Oxonium Ions. Solvation by Single Acetonitrile Molecules in the Gas Phase and by Bulk Solvents, J. Am. Chem. Soc., 1980, 103, 18, 5448, https://doi.org/10.1021/ja00408a028 . [all data]