Tetrahydrothiophene, positive ion

Reaction thermochemistry data

Data compiled by: Michael M. Meot-Ner (Mautner) and Sharon G. Lias

Individual Reactions

(C4H8S+ • Thiophene, tetrahydro-) + Thiophene, tetrahydro- = (C4H8S+ • 2Thiophene, tetrahydro-)

By formula: (C4H8S+ • C4H8S) + C4H8S = (C4H8S+ • 2C4H8S)

Quantity Value Units Method Reference Comment
Δr33.kJ/molPHPMSHiraoka, Takimoto, et al., 1987gas phase; Entropy change calculated or estimated
Quantity Value Units Method Reference Comment
Δr75.J/mol*KN/AHiraoka, Takimoto, et al., 1987gas phase; Entropy change calculated or estimated

C4H8S+ + Thiophene, tetrahydro- = (C4H8S+ • Thiophene, tetrahydro-)

By formula: C4H8S+ + C4H8S = (C4H8S+ • C4H8S)

Quantity Value Units Method Reference Comment
Δr70.7kJ/molPHPMSHiraoka, Takimoto, et al., 1987gas phase; ΔrH<

C4H8S+ + Water = (C4H8S+ • Water)

By formula: C4H8S+ + H2O = (C4H8S+ • H2O)

Quantity Value Units Method Reference Comment
Δr42.kJ/molPHPMSHiraoka, Takimoto, et al., 1987gas phase; ΔrH<

Ion clustering data

Data compiled by: Michael M. Meot-Ner (Mautner) and Sharon G. Lias

Clustering reactions

C4H8S+ + Thiophene, tetrahydro- = (C4H8S+ • Thiophene, tetrahydro-)

By formula: C4H8S+ + C4H8S = (C4H8S+ • C4H8S)

Quantity Value Units Method Reference Comment
Δr70.7kJ/molPHPMSHiraoka, Takimoto, et al., 1987gas phase; ΔrH<

(C4H8S+ • Thiophene, tetrahydro-) + Thiophene, tetrahydro- = (C4H8S+ • 2Thiophene, tetrahydro-)

By formula: (C4H8S+ • C4H8S) + C4H8S = (C4H8S+ • 2C4H8S)

Quantity Value Units Method Reference Comment
Δr33.kJ/molPHPMSHiraoka, Takimoto, et al., 1987gas phase; Entropy change calculated or estimated
Quantity Value Units Method Reference Comment
Δr75.J/mol*KN/AHiraoka, Takimoto, et al., 1987gas phase; Entropy change calculated or estimated

C4H8S+ + Water = (C4H8S+ • Water)

By formula: C4H8S+ + H2O = (C4H8S+ • H2O)

Quantity Value Units Method Reference Comment
Δr42.kJ/molPHPMSHiraoka, Takimoto, et al., 1987gas phase; ΔrH<

References

Hiraoka, Takimoto, et al., 1987
Hiraoka, K.; Takimoto, H.; Yamabe, S., Stabilities and Structures in Cluster Ions of Five-Membered Heterocyclic Compounds Containing O, N and S Atoms, J. Am. Chem. Soc., 1987, 109, 24, 7346, https://doi.org/10.1021/ja00258a018 . [all data]