Isobutene, positive ion

Reaction thermochemistry data

Data compiled by: Michael M. Meot-Ner (Mautner) and Sharon G. Lias

Individual Reactions

C4H8+ + Sulfur dioxide = (C4H8+ • Sulfur dioxide)

By formula: C4H8+ + O2S = (C4H8+ • O2S)

Quantity Value Units Method Reference Comment
Δr10.kJ/molPIGrover, Walters, et al., 1985gas phase

References

Grover, Walters, et al., 1985
Grover, J.R.; Walters, E.A.; Newman, J.K.; White, M.G., Measurement of the Dissociation Energies of Gas - Phase Neutral Dimers by a Photoionization Technique: Values for trans - 2 - Butene/Sulfur Dioxide , (trans - 2 - Butene)2, and Benzene/Sulfur Dioxide, J. Am. Chem. Soc., 1985, 107, 25, 7329, https://doi.org/10.1021/ja00311a020 . [all data]