Pyrrole, protonated

Reaction thermochemistry data

Data compiled by: Michael M. Meot-Ner (Mautner) and Sharon G. Lias

Individual Reactions

C4H6N+ + Water = (C4H6N+ • Water)

By formula: C4H6N+ + H2O = (C4H6N+ • H2O)

Bond type: Hydrogen bond (positive ion to hydride)

Quantity Value Units Method Reference Comment
Δr58.6kJ/molPHPMSNicol, Sunner, et al., 1988gas phase
Δr57.7kJ/molPHPMSHiraoka, Takimoto, et al., 1987gas phase
Δr67.kJ/molPHPMSMeot-Ner (Mautner), Ross, et al., 1985gas phase; Entropy change calculated or estimated, ΔrH<
Quantity Value Units Method Reference Comment
Δr97.5J/mol*KPHPMSNicol, Sunner, et al., 1988gas phase
Δr92.0J/mol*KPHPMSHiraoka, Takimoto, et al., 1987gas phase
Δr130.J/mol*KN/AMeot-Ner (Mautner), Ross, et al., 1985gas phase; Entropy change calculated or estimated, ΔrH<

Free energy of reaction

ΔrG° (kJ/mol) T (K) Method Reference Comment
21.344.PHPMSMeot-Ner (Mautner), Ross, et al., 1985gas phase; Entropy change calculated or estimated, ΔrH<

(C4H6N+ • Water) + Water = (C4H6N+ • 2Water)

By formula: (C4H6N+ • H2O) + H2O = (C4H6N+ • 2H2O)

Bond type: Hydrogen bond (positive ion to hydride)

Quantity Value Units Method Reference Comment
Δr43.5kJ/molPHPMSNicol, Sunner, et al., 1988gas phase
Δr45.6kJ/molPHPMSHiraoka, Takimoto, et al., 1987gas phase
Quantity Value Units Method Reference Comment
Δr94.6J/mol*KPHPMSNicol, Sunner, et al., 1988gas phase
Δr99.2J/mol*KPHPMSHiraoka, Takimoto, et al., 1987gas phase

(C4H6N+ • Pyrrole) + Pyrrole = (C4H6N+ • 2Pyrrole)

By formula: (C4H6N+ • C4H5N) + C4H5N = (C4H6N+ • 2C4H5N)

Quantity Value Units Method Reference Comment
Δr51.5kJ/molPHPMSHiraoka, Takimoto, et al., 1987gas phase
Quantity Value Units Method Reference Comment
Δr127.J/mol*KPHPMSHiraoka, Takimoto, et al., 1987gas phase

C4H6N+ + Pyrrole = (C4H6N+ • Pyrrole)

By formula: C4H6N+ + C4H5N = (C4H6N+ • C4H5N)

Quantity Value Units Method Reference Comment
Δr70.3kJ/molPHPMSHiraoka, Takimoto, et al., 1987gas phase
Quantity Value Units Method Reference Comment
Δr103.J/mol*KPHPMSHiraoka, Takimoto, et al., 1987gas phase

Ion clustering data

Data compiled by: Michael M. Meot-Ner (Mautner) and Sharon G. Lias

Clustering reactions

C4H6N+ + Pyrrole = (C4H6N+ • Pyrrole)

By formula: C4H6N+ + C4H5N = (C4H6N+ • C4H5N)

Quantity Value Units Method Reference Comment
Δr70.3kJ/molPHPMSHiraoka, Takimoto, et al., 1987gas phase
Quantity Value Units Method Reference Comment
Δr103.J/mol*KPHPMSHiraoka, Takimoto, et al., 1987gas phase

(C4H6N+ • Pyrrole) + Pyrrole = (C4H6N+ • 2Pyrrole)

By formula: (C4H6N+ • C4H5N) + C4H5N = (C4H6N+ • 2C4H5N)

Quantity Value Units Method Reference Comment
Δr51.5kJ/molPHPMSHiraoka, Takimoto, et al., 1987gas phase
Quantity Value Units Method Reference Comment
Δr127.J/mol*KPHPMSHiraoka, Takimoto, et al., 1987gas phase

C4H6N+ + Water = (C4H6N+ • Water)

By formula: C4H6N+ + H2O = (C4H6N+ • H2O)

Bond type: Hydrogen bond (positive ion to hydride)

Quantity Value Units Method Reference Comment
Δr58.6kJ/molPHPMSNicol, Sunner, et al., 1988gas phase
Δr57.7kJ/molPHPMSHiraoka, Takimoto, et al., 1987gas phase
Δr67.kJ/molPHPMSMeot-Ner (Mautner), Ross, et al., 1985gas phase; Entropy change calculated or estimated, ΔrH<
Quantity Value Units Method Reference Comment
Δr97.5J/mol*KPHPMSNicol, Sunner, et al., 1988gas phase
Δr92.0J/mol*KPHPMSHiraoka, Takimoto, et al., 1987gas phase
Δr130.J/mol*KN/AMeot-Ner (Mautner), Ross, et al., 1985gas phase; Entropy change calculated or estimated, ΔrH<

Free energy of reaction

ΔrG° (kJ/mol) T (K) Method Reference Comment
21.344.PHPMSMeot-Ner (Mautner), Ross, et al., 1985gas phase; Entropy change calculated or estimated, ΔrH<

(C4H6N+ • Water) + Water = (C4H6N+ • 2Water)

By formula: (C4H6N+ • H2O) + H2O = (C4H6N+ • 2H2O)

Bond type: Hydrogen bond (positive ion to hydride)

Quantity Value Units Method Reference Comment
Δr43.5kJ/molPHPMSNicol, Sunner, et al., 1988gas phase
Δr45.6kJ/molPHPMSHiraoka, Takimoto, et al., 1987gas phase
Quantity Value Units Method Reference Comment
Δr94.6J/mol*KPHPMSNicol, Sunner, et al., 1988gas phase
Δr99.2J/mol*KPHPMSHiraoka, Takimoto, et al., 1987gas phase

References

Nicol, Sunner, et al., 1988
Nicol, G.; Sunner, J.; Kebarle, P., Kinetics and Thermodynamics of Protonation Reactions: H3O+(H2O)h + B = BH+(H2O)b + (h - b +1)H2O, where B is a Nitrogen, Oxygen or Carbon Base, Int. J. Mass Spectrom. Ion Proc., 1988, 84, 1-2, 135, https://doi.org/10.1016/0168-1176(88)83032-5 . [all data]

Hiraoka, Takimoto, et al., 1987
Hiraoka, K.; Takimoto, H.; Yamabe, S., Stabilities and Structures in Cluster Ions of Five-Membered Heterocyclic Compounds Containing O, N and S Atoms, J. Am. Chem. Soc., 1987, 109, 24, 7346, https://doi.org/10.1021/ja00258a018 . [all data]

Meot-Ner (Mautner), Ross, et al., 1985
Meot-Ner (Mautner), M.; Ross, M.M.; Campana, J.E., Stable Hydrogen - Bonded Isomers of Covalent Ions, J. Am. Chem. Soc., 1985, 107, 4835. [all data]