Thiophene, protonated

Reaction thermochemistry data

Data compiled by: Michael M. Meot-Ner (Mautner) and Sharon G. Lias

Individual Reactions

C4H5S+ + Water = (C4H5S+ • Water)

By formula: C4H5S+ + H2O = (C4H5S+ • H2O)

Quantity Value Units Method Reference Comment
Δr41.8kJ/molPHPMSNicol, Sunner, et al., 1988gas phase
Δr42.7kJ/molPHPMSHiraoka, Takimoto, et al., 1987gas phase
Quantity Value Units Method Reference Comment
Δr86.2J/mol*KPHPMSNicol, Sunner, et al., 1988gas phase
Δr83.3J/mol*KPHPMSHiraoka, Takimoto, et al., 1987gas phase

C4H5S+ + Thiophene = (C4H5S+ • Thiophene)

By formula: C4H5S+ + C4H4S = (C4H5S+ • C4H4S)

Quantity Value Units Method Reference Comment
Δr48.1kJ/molPHPMSHiraoka, Takimoto, et al., 1987gas phase; ΔrH<

Ion clustering data

Data compiled by: Michael M. Meot-Ner (Mautner) and Sharon G. Lias

Clustering reactions

C4H5S+ + Thiophene = (C4H5S+ • Thiophene)

By formula: C4H5S+ + C4H4S = (C4H5S+ • C4H4S)

Quantity Value Units Method Reference Comment
Δr48.1kJ/molPHPMSHiraoka, Takimoto, et al., 1987gas phase; ΔrH<

C4H5S+ + Water = (C4H5S+ • Water)

By formula: C4H5S+ + H2O = (C4H5S+ • H2O)

Quantity Value Units Method Reference Comment
Δr41.8kJ/molPHPMSNicol, Sunner, et al., 1988gas phase
Δr42.7kJ/molPHPMSHiraoka, Takimoto, et al., 1987gas phase
Quantity Value Units Method Reference Comment
Δr86.2J/mol*KPHPMSNicol, Sunner, et al., 1988gas phase
Δr83.3J/mol*KPHPMSHiraoka, Takimoto, et al., 1987gas phase

References

Nicol, Sunner, et al., 1988
Nicol, G.; Sunner, J.; Kebarle, P., Kinetics and Thermodynamics of Protonation Reactions: H3O+(H2O)h + B = BH+(H2O)b + (h - b +1)H2O, where B is a Nitrogen, Oxygen or Carbon Base, Int. J. Mass Spectrom. Ion Proc., 1988, 84, 1-2, 135, https://doi.org/10.1016/0168-1176(88)83032-5 . [all data]

Hiraoka, Takimoto, et al., 1987
Hiraoka, K.; Takimoto, H.; Yamabe, S., Stabilities and Structures in Cluster Ions of Five-Membered Heterocyclic Compounds Containing O, N and S Atoms, J. Am. Chem. Soc., 1987, 109, 24, 7346, https://doi.org/10.1021/ja00258a018 . [all data]