Butanedioic acid, conjugate base

Reaction thermochemistry data

Data compiled by: Michael M. Meot-Ner (Mautner) and Sharon G. Lias

Individual Reactions

(C4H5O4- • Water) + Water = (C4H5O4- • 2Water)

By formula: (C4H5O4- • H2O) + H2O = (C4H5O4- • 2H2O)

Bond type: Hydrogen bond (negative ion to hydride)

Quantity Value Units Method Reference Comment
Δr17.kJ/molES/HPMSBlades, Klassen, et al., 1995gas phase

C4H5O4- + Water = (C4H5O4- • Water)

By formula: C4H5O4- + H2O = (C4H5O4- • H2O)

Bond type: Hydrogen bond (negative ion to hydride)

Quantity Value Units Method Reference Comment
Δr23.kJ/molES/HPMSBlades, Klassen, et al., 1995gas phase

Ion clustering data

Data compiled by: Michael M. Meot-Ner (Mautner) and Sharon G. Lias

Clustering reactions

C4H5O4- + Water = (C4H5O4- • Water)

By formula: C4H5O4- + H2O = (C4H5O4- • H2O)

Bond type: Hydrogen bond (negative ion to hydride)

Quantity Value Units Method Reference Comment
Δr23.kJ/molES/HPMSBlades, Klassen, et al., 1995gas phase

(C4H5O4- • Water) + Water = (C4H5O4- • 2Water)

By formula: (C4H5O4- • H2O) + H2O = (C4H5O4- • 2H2O)

Bond type: Hydrogen bond (negative ion to hydride)

Quantity Value Units Method Reference Comment
Δr17.kJ/molES/HPMSBlades, Klassen, et al., 1995gas phase

References

Blades, Klassen, et al., 1995
Blades, A.T.; Klassen, J.S.; Kebarle, P., Free Energies of Hydration in the Gas Phase on the Anions of Some Oxo Acids of C, N, S, P, Cl and I, J. Am. Chem. Soc., 1995, 117, 42, 10563, https://doi.org/10.1021/ja00147a019 . [all data]