Furan, protonated

Ion clustering data

Data compiled by: Michael M. Meot-Ner (Mautner) and Sharon G. Lias

Clustering reactions

C4H5O+ + Furan = (C4H5O+ • Furan)

By formula: C4H5O+ + C4H4O = (C4H5O+ • C4H4O)

Bond type: Hydrogen bonds of the type OH-O between organics

Quantity Value Units Method Reference Comment
Δr10.kcal/molPHPMSHiraoka, Takimoto, et al., 1987gas phase; ΔrH<
Δr19.kcal/molPHPMSMeot-Ner (Mautner), Ross, et al., 1985gas phase; Entropy change calculated or estimated, ΔrH<
Quantity Value Units Method Reference Comment
Δr32.cal/mol*KN/AMeot-Ner (Mautner), Ross, et al., 1985gas phase; Entropy change calculated or estimated, ΔrH<

Free energy of reaction

ΔrG° (kcal/mol) T (K) Method Reference Comment
6.6382.PHPMSMeot-Ner (Mautner), Ross, et al., 1985gas phase; Entropy change calculated or estimated, ΔrH<

C4H5O+ + Water = (C4H5O+ • Water)

By formula: C4H5O+ + H2O = (C4H5O+ • H2O)

Bond type: Hydrogen bond (positive ion to hydride)

Quantity Value Units Method Reference Comment
Δr10.4kcal/molPHPMSNicol, Sunner, et al., 1988gas phase
Δr10.2kcal/molPHPMSHiraoka, Takimoto, et al., 1987gas phase
Δr16.kcal/molPHPMSMeot-Ner (Mautner), Ross, et al., 1985gas phase; Entropy change calculated or estimated, ΔrH<
Quantity Value Units Method Reference Comment
Δr20.cal/mol*KPHPMSNicol, Sunner, et al., 1988gas phase
Δr19.7cal/mol*KPHPMSHiraoka, Takimoto, et al., 1987gas phase
Δr32.cal/mol*KN/AMeot-Ner (Mautner), Ross, et al., 1985gas phase; Entropy change calculated or estimated, ΔrH<

Free energy of reaction

ΔrG° (kcal/mol) T (K) Method Reference Comment
4.2382.PHPMSMeot-Ner (Mautner), Ross, et al., 1985gas phase; Entropy change calculated or estimated, ΔrH<

References

Hiraoka, Takimoto, et al., 1987
Hiraoka, K.; Takimoto, H.; Yamabe, S., Stabilities and Structures in Cluster Ions of Five-Membered Heterocyclic Compounds Containing O, N and S Atoms, J. Am. Chem. Soc., 1987, 109, 24, 7346, https://doi.org/10.1021/ja00258a018 . [all data]

Meot-Ner (Mautner), Ross, et al., 1985
Meot-Ner (Mautner), M.; Ross, M.M.; Campana, J.E., Stable Hydrogen - Bonded Isomers of Covalent Ions, J. Am. Chem. Soc., 1985, 107, 4835. [all data]

Nicol, Sunner, et al., 1988
Nicol, G.; Sunner, J.; Kebarle, P., Kinetics and Thermodynamics of Protonation Reactions: H3O+(H2O)h + B = BH+(H2O)b + (h - b +1)H2O, where B is a Nitrogen, Oxygen or Carbon Base, Int. J. Mass Spectrom. Ion Proc., 1988, 84, 1-2, 135, https://doi.org/10.1016/0168-1176(88)83032-5 . [all data]