Thiophene, positive ion

Reaction thermochemistry data

Data compiled by: Michael M. Meot-Ner (Mautner) and Sharon G. Lias

Individual Reactions

C4H4S+ + Water = (C4H4S+ • Water)

By formula: C4H4S+ + H2O = (C4H4S+ • H2O)

Quantity Value Units Method Reference Comment
Δr40.kJ/molPHPMSHiraoka, Takimoto, et al., 1987gas phase
Quantity Value Units Method Reference Comment
Δr74.1J/mol*KPHPMSHiraoka, Takimoto, et al., 1987gas phase

C4H4S+ + Thiophene = (C4H4S+ • Thiophene)

By formula: C4H4S+ + C4H4S = (C4H4S+ • C4H4S)

Quantity Value Units Method Reference Comment
Δr70.7kJ/molPHPMSHiraoka, Takimoto, et al., 1987gas phase
Quantity Value Units Method Reference Comment
Δr96.7J/mol*KPHPMSHiraoka, Takimoto, et al., 1987gas phase

C4H4S+ + Benzene = (C4H4S+ • Benzene)

By formula: C4H4S+ + C6H6 = (C4H4S+ • C6H6)

Quantity Value Units Method Reference Comment
Δr54.kJ/molHPMSField, Hamlet, et al., 1969gas phase
Quantity Value Units Method Reference Comment
Δr96.J/mol*KHPMSField, Hamlet, et al., 1969gas phase

(C4H4S+ • Thiophene) + Thiophene = (C4H4S+ • 2Thiophene)

By formula: (C4H4S+ • C4H4S) + C4H4S = (C4H4S+ • 2C4H4S)

Quantity Value Units Method Reference Comment
Δr31.kJ/molPHPMSHiraoka, Takimoto, et al., 1987gas phase; ΔrH<

Ion clustering data

Data compiled by: Michael M. Meot-Ner (Mautner) and Sharon G. Lias

Clustering reactions

C4H4S+ + Thiophene = (C4H4S+ • Thiophene)

By formula: C4H4S+ + C4H4S = (C4H4S+ • C4H4S)

Quantity Value Units Method Reference Comment
Δr70.7kJ/molPHPMSHiraoka, Takimoto, et al., 1987gas phase
Quantity Value Units Method Reference Comment
Δr96.7J/mol*KPHPMSHiraoka, Takimoto, et al., 1987gas phase

(C4H4S+ • Thiophene) + Thiophene = (C4H4S+ • 2Thiophene)

By formula: (C4H4S+ • C4H4S) + C4H4S = (C4H4S+ • 2C4H4S)

Quantity Value Units Method Reference Comment
Δr31.kJ/molPHPMSHiraoka, Takimoto, et al., 1987gas phase; ΔrH<

C4H4S+ + Benzene = (C4H4S+ • Benzene)

By formula: C4H4S+ + C6H6 = (C4H4S+ • C6H6)

Quantity Value Units Method Reference Comment
Δr54.kJ/molHPMSField, Hamlet, et al., 1969gas phase
Quantity Value Units Method Reference Comment
Δr96.J/mol*KHPMSField, Hamlet, et al., 1969gas phase

C4H4S+ + Water = (C4H4S+ • Water)

By formula: C4H4S+ + H2O = (C4H4S+ • H2O)

Quantity Value Units Method Reference Comment
Δr40.kJ/molPHPMSHiraoka, Takimoto, et al., 1987gas phase
Quantity Value Units Method Reference Comment
Δr74.1J/mol*KPHPMSHiraoka, Takimoto, et al., 1987gas phase

References

Hiraoka, Takimoto, et al., 1987
Hiraoka, K.; Takimoto, H.; Yamabe, S., Stabilities and Structures in Cluster Ions of Five-Membered Heterocyclic Compounds Containing O, N and S Atoms, J. Am. Chem. Soc., 1987, 109, 24, 7346, https://doi.org/10.1021/ja00258a018 . [all data]

Field, Hamlet, et al., 1969
Field, F.H.; Hamlet, P.; Libby, W.F., Effect of Temperature on the Mass Spectrum of Benzene at High Pressures, J. Am. Chem. Soc., 1969, 91, 11, 2839, https://doi.org/10.1021/ja01039a003 . [all data]