Diethanolamine, protonated

Ion clustering data

Data compiled by: Michael M. Meot-Ner (Mautner) and Sharon G. Lias

Clustering reactions

C4H12NO2+ + Diethanolamine = (C4H12NO2+ • Diethanolamine)

By formula: C4H12NO2+ + C4H11NO2 = (C4H12NO2+ • C4H11NO2)

Bond type: Hydrogen bonds of the type OH-O between organics

Free energy of reaction

ΔrG° (kcal/mol) T (K) Method Reference Comment
8.2500.PHPMSSunner, Kulatunga, et al., 1986gas phase

References

Sunner, Kulatunga, et al., 1986
Sunner, J.A.; Kulatunga, R.; Kebarle, P., Fast Atom Bombardment Mass Spectrometry and Gas Phase Basicities, Anal. Chem., 1986, 58, 7, 1312, https://doi.org/10.1021/ac00298a010 . [all data]