1-Propanethiol, protonated

Ion clustering data

Data compiled by: Michael M. Meot-Ner (Mautner) and Sharon G. Lias

Clustering reactions

C3H9S+ + Water = (C3H9S+ • Water)

By formula: C3H9S+ + H2O = (C3H9S+ • H2O)

Quantity Value Units Method Reference Comment
Δr60.2kJ/molPHPMSMeot-Ner (Mautner) and Sieck, 1985gas phase
Quantity Value Units Method Reference Comment
Δr96.J/mol*KPHPMSMeot-Ner (Mautner) and Sieck, 1985gas phase

Free energy of reaction

ΔrG° (kJ/mol) T (K) Method Reference Comment
17.446.PHPMSMeot-Ner (Mautner) and Sieck, 1985gas phase

References

Meot-Ner (Mautner) and Sieck, 1985
Meot-Ner (Mautner), M.; Sieck, L.W., The Ionic Hydrogen Bond and Ion Solvation. 4. SH+ O and NH+ S Bonds. Correlations with Proton Affinity. Mutual Effects of Weak and Strong Ligands in Mixed Clusters, J. Phys. Chem., 1985, 89, 24, 5222, https://doi.org/10.1021/j100270a021 . [all data]