Acetamide, N-methyl-, protonated

Reaction thermochemistry data

Data compiled by: Michael M. Meot-Ner (Mautner) and Sharon G. Lias

Individual Reactions

C3H8NO+ + Acetamide, N-methyl- = (C3H8NO+ • Acetamide, N-methyl-)

By formula: C3H8NO+ + C3H7NO = (C3H8NO+ • C3H7NO)

Bond type: Hydrogen bonds of the type OH-O between organics

Quantity Value Units Method Reference Comment
Δr29.8kcal/molPHPMSMeot-Ner, 1984gas phase
Quantity Value Units Method Reference Comment
Δr23.6cal/mol*KPHPMSMeot-Ner, 1984gas phase

Ion clustering data

Data compiled by: Michael M. Meot-Ner (Mautner) and Sharon G. Lias

Clustering reactions

C3H8NO+ + Acetamide, N-methyl- = (C3H8NO+ • Acetamide, N-methyl-)

By formula: C3H8NO+ + C3H7NO = (C3H8NO+ • C3H7NO)

Bond type: Hydrogen bonds of the type OH-O between organics

Quantity Value Units Method Reference Comment
Δr29.8kcal/molPHPMSMeot-Ner, 1984gas phase
Quantity Value Units Method Reference Comment
Δr23.6cal/mol*KPHPMSMeot-Ner, 1984gas phase

References

Meot-Ner, 1984
Meot-Ner, (Mautner), The Ionic Hydrogen Bond. 4. Intramolecular and Multiple Bonds. Proton Affinities, Hydration and Complexes of Amides and Amino Acid Derivatives, J. Am. Chem. Soc., 1984, 106, 2, 278, https://doi.org/10.1021/ja00314a003 . [all data]