Acetone, positive ion

Reaction thermochemistry data

Data compiled by: Michael M. Meot-Ner (Mautner) and Sharon G. Lias

Individual Reactions

C3H6O+ + Acetone = (C3H6O+ • Acetone)

By formula: C3H6O+ + C3H6O = (C3H6O+ • C3H6O)

Quantity Value Units Method Reference Comment
Δr51.9kJ/molPITrott, Blais, et al., 1978gas phase; ΔrH>

Ion clustering data

Data compiled by: Michael M. Meot-Ner (Mautner) and Sharon G. Lias

Clustering reactions

C3H6O+ + Acetone = (C3H6O+ • Acetone)

By formula: C3H6O+ + C3H6O = (C3H6O+ • C3H6O)

Quantity Value Units Method Reference Comment
Δr51.9kJ/molPITrott, Blais, et al., 1978gas phase; ΔrH>

References

Trott, Blais, et al., 1978
Trott, W.M.; Blais, N.C.; Walters, E.A., Molecular beam photoionization study of acetone and acetone-d6, J. Chem. Phys., 1978, 69, 3150. [all data]