Acetamide, N-methyl-, conjugate base
- Formula: C3H6NO-
- Molecular weight: 72.0864

Reaction thermochemistry data

Data compiled by: Michael M. Meot-Ner (Mautner) and Sharon G. Lias
Individual Reactions
By formula: C3H6NO- + C3H7NO = (C3H6NO- • C3H7NO)
Quantity | Value | Units | Method | Reference | Comment |
---|---|---|---|---|---|
ΔrH° | 27. | kcal/mol | PHPMS | Meot-Ner (Mautner), 1988 | gas phase |
Quantity | Value | Units | Method | Reference | Comment |
ΔrS° | 30. | cal/mol*K | PHPMS | Meot-Ner (Mautner), 1988 | gas phase |
Free energy of reaction
ΔrG° (kcal/mol) | T (K) | Method | Reference | Comment |
---|---|---|---|---|
12.5 | 497. | PHPMS | Meot-Ner (Mautner), 1988 | gas phase |

Ion clustering data

Data compiled by: Michael M. Meot-Ner (Mautner) and Sharon G. Lias
Clustering reactions
By formula: C3H6NO- + C3H7NO = (C3H6NO- • C3H7NO)
Quantity | Value | Units | Method | Reference | Comment |
---|---|---|---|---|---|
ΔrH° | 27. | kcal/mol | PHPMS | Meot-Ner (Mautner), 1988 | gas phase |
Quantity | Value | Units | Method | Reference | Comment |
ΔrS° | 30. | cal/mol*K | PHPMS | Meot-Ner (Mautner), 1988 | gas phase |
Free energy of reaction
ΔrG° (kcal/mol) | T (K) | Method | Reference | Comment |
---|---|---|---|---|
12.5 | 497. | PHPMS | Meot-Ner (Mautner), 1988 | gas phase |

References

Meot-Ner (Mautner), 1988
Meot-Ner (Mautner), M.,
Models for Strong Interactions in Proteins and Enzymes. 2. Interactions of Ions with the Peptide Link and Imidazole,
J. Am. Chem. Soc., 1988, 110, 10, 3075, https://doi.org/10.1021/ja00218a014
. [all data]