Allyl, positive ion

Reaction thermochemistry data

Data compiled by: Michael M. Meot-Ner (Mautner) and Sharon G. Lias

Individual Reactions

C3H5+ + Ethylene = (C3H5+ • Ethylene)

By formula: C3H5+ + C2H4 = (C3H5+ • C2H4)

Quantity Value Units Method Reference Comment
Δr69.9kJ/molPICeyer, Tiedemann, et al., 1979gas phase

Ion clustering data

Data compiled by: Michael M. Meot-Ner (Mautner) and Sharon G. Lias

Clustering reactions

C3H5+ + Ethylene = (C3H5+ • Ethylene)

By formula: C3H5+ + C2H4 = (C3H5+ • C2H4)

Quantity Value Units Method Reference Comment
Δr69.9kJ/molPICeyer, Tiedemann, et al., 1979gas phase

References

Ceyer, Tiedemann, et al., 1979
Ceyer, S.T.; Tiedemann, P.W.; Ng, C.Y.; Mahan, B.H.; Lee, Y.T., Photoionization of Ethylene Clusters, J. Chem. Phys., 1979, 70, 5, 2138, https://doi.org/10.1063/1.437758 . [all data]