Propenaldimine-1-yl, positive ion

Reaction thermochemistry data

Data compiled by: Michael M. Meot-Ner (Mautner) and Sharon G. Lias

Individual Reactions

C3H4N+ + 2-Propenenitrile = (C3H4N+ • 2-Propenenitrile)

By formula: C3H4N+ + C3H3N = (C3H4N+ • C3H3N)

Quantity Value Units Method Reference Comment
Δr30.7kcal/molPHPMSMeot-Ner (Mautner) and Sieck, 1991gas phase
Quantity Value Units Method Reference Comment
Δr29.3cal/mol*KPHPMSMeot-Ner (Mautner) and Sieck, 1991gas phase

References

Meot-Ner (Mautner) and Sieck, 1991
Meot-Ner (Mautner), M.; Sieck, L.W., Proton affinity ladders from variable-temperature equilibrium measurements. 1. A reevaluation of the upper proton affinity range, J. Am. Chem. Soc., 1991, 113, 12, 4448, https://doi.org/10.1021/ja00012a012 . [all data]