Propiolonitrile, protonated

Reaction thermochemistry data

Data compiled by: Michael M. Meot-Ner (Mautner) and Sharon G. Lias

Individual Reactions

C3H2N+ + Water = (C3H2N+ • Water)

By formula: C3H2N+ + H2O = (C3H2N+ • H2O)

Bond type: Hydrogen bond (positive ion to hydride)

Quantity Value Units Method Reference Comment
Δr23.3kcal/molPHPMSSpeller and Meot-Ner (Mautner), 1985gas phase
Quantity Value Units Method Reference Comment
Δr23.8cal/mol*KPHPMSSpeller and Meot-Ner (Mautner), 1985gas phase

C3H2N+ + Propiolonitrile = (C3H2N+ • Propiolonitrile)

By formula: C3H2N+ + C3HN = (C3H2N+ • C3HN)

Quantity Value Units Method Reference Comment
Δr27.4kcal/molPHPMSSpeller and Meot-Ner (Mautner), 1985gas phase
Quantity Value Units Method Reference Comment
Δr25.7cal/mol*KPHPMSSpeller and Meot-Ner (Mautner), 1985gas phase

C3H2N+ + Hydrogen cyanide = (C3H2N+ • Hydrogen cyanide)

By formula: C3H2N+ + CHN = (C3H2N+ • CHN)

Quantity Value Units Method Reference Comment
Δr23.8kcal/molPHPMSSpeller and Meot-Ner (Mautner), 1985gas phase
Quantity Value Units Method Reference Comment
Δr25.6cal/mol*KPHPMSSpeller and Meot-Ner (Mautner), 1985gas phase

References

Speller and Meot-Ner (Mautner), 1985
Speller, C.V.; Meot-Ner (Mautner), M., The Ionic Hydrogen Bond and Ion Solvation. 3. Bonds Involving Cyanides. Correlations with Proton Affinites, J. Phys. Chem., 1985, 81, 24, 5217, https://doi.org/10.1021/j100270a020 . [all data]