2-Propanol, 1,1,1,3,3,3-hexafluoro-, conjugate base

Reaction thermochemistry data

Data compiled by: Michael M. Meot-Ner (Mautner) and Sharon G. Lias

Individual Reactions

C3HF6O- + hydrogen fluoride = (C3HF6O- • hydrogen fluoride)

By formula: C3HF6O- + HF = (C3HF6O- • HF)

Bond type: Hydrogen bond (negative ion to hydride)

Quantity Value Units Method Reference Comment
Δr100.kJ/molICRLarson and McMahon, 1983gas phase

References

Larson and McMahon, 1983
Larson, J.W.; McMahon, T.B., Strong hydrogen bonding in gas-phase anions. An ion cyclotron resonance determination of fluoride binding energetics to bronsted acids from gas-phase fluoride exchange equilibria measurements, J. Am. Chem. Soc., 1983, 105, 2944. [all data]