2,2-Difluoroethanol, protonated

Ion clustering data

Data compiled by: Michael M. Meot-Ner (Mautner) and Sharon G. Lias

Clustering reactions

C2H5F2O+ + Water = (C2H5F2O+ • Water)

By formula: C2H5F2O+ + H2O = (C2H5F2O+ • H2O)

Bond type: Hydrogen bond (positive ion to hydride)

Quantity Value Units Method Reference Comment
Δr100.kJ/molICRBerman and Beauchamp, 1986gas phase; bracketing; Lias, Liebman, et al., 1984

References

Berman and Beauchamp, 1986
Berman, D.W.; Beauchamp, J.L., Quoted in Keesee and Castleman, 1986, 1986. [all data]

Lias, Liebman, et al., 1984
Lias, S.G.; Liebman, J.F.; Levin, R.D., Evaluated gas phase basicities and proton affinities of molecules heats of formation of protonated molecules, J. Phys. Chem. Ref. Data, 1984, 13, 695. [all data]

Keesee and Castleman, 1986
Keesee, R.G.; Castleman, A.W., Jr., Thermochemical data on Ggs-phase ion-molecule association and clustering reactions, J. Phys. Chem. Ref. Data, 1986, 15, 1011. [all data]